Traffic environment ontology (TE)
type: Ontology
comment: The traffic environment ontology (TE) provides a model for traffic infrastructure. It contains many classes and properties extracted from: Map Ontology created by Lihua Zhao and Yutaka Sasaki at the Computational Intelligence Laboratory, Toyota Technological Institute, Nagoya, Japan (see https://www.toyota-ti.ac.jp/Lab/Denshi/COIN/Ontology/TTICore-0.03/) and published by the Toyota Technological Institute Smart Vehicle Research Project.
abstract: A sophisticated machine understandable map is required for autonomous vehicles to perceive driving environments. Therefore, we construct a map ontology.
license: https://creativecommons.org/licenses/by-nc-sa/4.0/
content language: http://www.w3.org/standards/techs/owl#w3c_all
depends on: https://spec.edmcouncil.org/auto/ontology/EC/
file abbreviation: auto-de-map
filename: Map.rdf
imports: MiddleOntology
imports: AnnotationVocabulary
has maturity level: Provisional

airport
type: Class
subclass of: infrastructure
definition: place from which aircraft operate that usually has paved runways and maintenance facilities and often serves as a terminal

airway
type: Class
subclass of: transport way
definition: A transport way reserved primarily for use by aircraft taking off, in flight, or landing.
adapted from: ANSI D.16-2017, section 2.1.9

amenity
type: Class
subclass of: infrastructure
definition: something that helps to provide comfort, convenience, or enjoyment

at grade intersection
type: Class
subclass of: intersection
definition: An intersection where all roadways cross or join at the same level.
adapted from: ANSI D.16-2017, section 2.5.12

auxiliary road sign
type: Class
subclass of: road sign
definition: sign that provides information such as direction, time and temperature displays, hours of operation, or warning; auxiliary signs are intended for the convenience of the public. An auxiliary sign may include the business name and/or logo, but may not include its product or services

bank
type: Class
subclass of: building
definition: establishment for the custody, loan, exchange, or issue of money, for the extension of credit, and for facilitating the transmission of funds

bicycle lane
type: Class
subclass of: bikeway
definition: A bikeway adjacent to travel lanes which has been designated for preferential or exclusive use by pedalcyclists through striping, signage or pavement markings
adapted from: ANSI D.16-2017, section 2.2.45

bicycle trail
type: Class
subclass of: bikeway
definition: A bikeway reserved for pedalcycles and separated from roadways by open space or barriers.

bikeway
type: Class
subclass of: transport way
definition: A trafficway specifically designated as being open for pedalcycle travel or, where various classes of pedalcycle are segregated, that part of a trafficway open for a particular class (See 2.2.28)

building
type: Class
subclass of: infrastructure
definition: usually roofed and walled structure built for permanent use

bus lane
type: Class
subclass of: lane
definition: part of the road which is intended to be used only by buses

bus station
type: Class
subclass of: station
definition: place incorporating waiting areas, stands for buses, and ticket offices from which buses or coaches depart

bus stop
type: Class
subclass of: bus station
definition: place on a road where buses stop to let passengers on and off

business district
type: Class
subclass of: urban district
disjoint with: residential district
definition: territory contiguous to and including a highway when within any 600 feet along such highway there are buildings in use for business or industrial purposes, including but not limited to hotels, banks, office buildings, railroad stations and public buildings which occupy at least 300 feet of frontage on one side or 300 feet collectively on both sides of the highway

channelized intersection
type: Class
subclass of: at grade intersection
definition: An at-grade intersection in which traffic is diverted into definite paths by raised or painted traffic islands.
adapted from: ANSI D.16-2017, section 2.5.13

city street
type: Class
subclass of: trafficway
definition: A trafficway within a city trafficway system that is not an Interstate highway, other U.S. route numbered highway, other state route numbered highway, or county road.
adapted from: ANSI D.16-2017, section 2.5.8

college
type: Class
subclass of: educational institute
definition: institution offering instruction, usually in a professional, vocational, or technical field

convenience
type: Class
subclass of: shop
definition: small, often franchised market that is open long hours

county road
type: Class
subclass of: trafficway
definition: A trafficway within a county trafficway system that is not an Interstate highway, other U.S. route numbered highway, or other state route numbered highway.
adapted from: ANSI D.16-2017, section 2.5.7

crosswalk
type: Class
subclass of: road part
definition: (1) that part of a roadway at an intersection included within the connections of the lateral lines of the sidewalks on opposite sides of the roadway measured from the curbs or, in the absence of curbs, from the edges of the traversable roadway, or (2) any portion of a roadway at an intersection or elsewhere distinctly indicated for pedestrian crossing by lines or other markings on the surface of the roadway.
adapted from: ANSI D.16-2017, section 2.5.21

crosswalk road segment
type: Class
subclass of: road segment
definition: road segment which contains a crosswalk

curb return
type: Class
subclass of: road part
definition: The curved section of curb used at intersections in joining straight sections of curb.
adapted from: ANSI D.16-2017, section 2.5.20

directional road sign
type: Class
subclass of: road sign
definition: sign installed on public land that advertises the direction to be taken to a service, tourist attraction or a townsite/locality

driveway
type: Class
subclass of: trafficway
comment: A driveway is outside the trafficway and is typically not provided an official identification name or number.
definition: A private way which provides vehicular access to the public from a trafficway to property, parking or loading areas outside the boundaries of the trafficway, but is considered to be not open to the public for transportation purposes as a trafficway.
adapted from: ANSI D.16-2017, section 2.5.9.1

driveway access
type: Class
subclass of: road part
definition: A portion of the trafficway at the end of a driveway (See 2.5.9.1), providing access to property adjacent to a trafficway.
adapted from: ANSI D.16-2017, section 2.5.9

educational institute
type: Class
subclass of: building
definition: institute that provides education as its main purpose

end lane
type: Class
subclass of: lane segment
disjoint with: start lane
definition: lane located at the end of a path

end node
type: Class
subclass of: node
disjoint with: start node
definition: end GPS position of a path

fast food
type: Class
subclass of: restaurant
definition: restaurant specializing in food that can be prepared and served quickly

fire station
type: Class
subclass of: building
definition: building housing fire apparatus and usually firefighters

forest
type: Class
subclass of: natural place
definition: dense growth of trees and underbrush covering a large tract

frontage road
type: Class
subclass of: trafficway
comment: The frontage road may be within the same trafficway as the main roadway or in a separate trafficway.
definition: A roadway generally paralleling an expressway, freeway, parkway or through street so designed as to intercept, collect and distribute traffic desiring to cross, enter or leave such facility and to furnish access to property which otherwise would be isolated as a result of controlled-access features.
adapted from: ANSI D.16-2017, section 2.5.18

fully-controlled access highway
type: Class
subclass of: trafficway
definition: A trafficway on which preference is given to through traffic by permitting access only from other trafficways and by providing grade separations at all crossing trafficways.
adapted from: ANSI D.16-2017, section 2.5.15

gas station
type: Class
subclass of: infrastructure
definition: retail station for servicing motor vehicles, especially with gasoline and oil

gore
type: Class
subclass of: road part
comment: The area is bounded on two sides by the edges of the roadways, which join at the point of divergence or convergence. The direction of traffic shall be the same on both sides of these roadways. The area includes shoulders or marked pavement, if any, between the roadways. The third side is 60 meters (approximately 200 feet) from the point of divergence or convergence or, if any other road is within 70 meters (230 feet) of that point, a line 10 meters (33 feet) from the nearest edge of such road.
definition: An area of land where two roadways diverge or converge.
adapted from: ANSI D.16-2017, section 2.5.19

grade separation
type: Class
subclass of: intersection
definition: A crossing at different levels of two trafficways, or a trafficway and a railway.
adapted from: ANSI D.16-2017, section 2.5.14

highway
type: Class
subclass of: road type
definition: road that is part of the strategic traffic network for automobiles across the country and connects areas of political/economic importance or areas that are critical to the nation's interests

hospital
type: Class
subclass of: building
definition: institution where the sick or injured are given medical or surgical care

infrastructure
type: Class
subclass of: MaterialEntity
definition: basic installations and facilities on which the continuance and growth of a community, state, etc. depend, such as roads, schools, power plants, transportation and communication systems, etc.

instruction road sign
type: Class
subclass of: road sign
definition: sign which does not contain advertising or promotional matter but relates solely to traffic or pedestrian control, warnings or hours of operation

instruction surface sign
type: Class
subclass of: road surface marking
definition: sign which does not contain advertising or promotional matter but relates solely to traffic or pedestrian control, warnings or hours of operation, that is located on the road surface

interchange
type: Class
subclass of: road part
definition: A system of interconnecting roadways in conjunction with one or more grade separations, providing for the movement of traffic between two or more roadways on different levels.
adapted from: ANSI D.16-2017, section 2.5.16

intersection
type: Class
subclass of: junction
subclass of: road part
comment: Where the distance along a roadway between two areas meeting these criteria is less than 10 meters (33 feet), the two areas and the roadway connecting them are considered to be parts of a single intersection.
definition: An area which (1) contains a crossing or connection of two or more roadways not classified as driveway access and (2) is embraced within the prolongation of the lateral curb lines or, if none, the lateral boundary lines of the roadways.
adapted from: ANSI D.16-2017, section 2.5.10

intersection segment
type: Class
subclass of: path segment
disjoint with: lane segment
definition: path segment that contains an intersection of two or more lanes

interstate highway
type: Class
subclass of: trafficway
definition: A trafficway on the Interstate System.
adapted from: ANSI D.16-2017, section 2.5.4

interstate system
type: Class
subclass of: infrastructure
definition: The National System of Interstate and Defense Highways as defined in Section 101, Title 23, United States Code.
adapted from: ANSI D.16-2017, section 2.5.3

junction
type: Class
subclass of: road part
definition: An intersection or the connection between a driveway access and a roadway other than a driveway access.
adapted from: ANSI D.16-2017, section 2.5.11

kindergarten
type: Class
subclass of: educational institute
definition: school or class for children usually from four to six years old

lake
type: Class
subclass of: natural place
definition: considerable inland body of standing water

land way
type: Class
subclass of: trafficway
definition: The space within property lines or other boundary lines of any transport way that is neither an airway nor a waterway.

lane
type: Class
subclass of: road part
definition: one of the longitudinal strips into which the carriageway is divisible, whether or not defined by longitudinal road markings, which is wide enough for one moving line of motor vehicles other than motorcycles

lane adapter
type: Class
subclass of: junction
definition: connection between an uncontrolled intersection and a two-way narrow road

lane segment
type: Class
subclass of: path segment

leisure
type: Class
subclass of: amenity
definition: large public building containing different facilities for leisure activities

local road
type: Class
subclass of: ordinary road

longitudinal part of trafficway
type: Class
subclass of: infrastructure
subclass of: road part
definition: part of a traffic way which is a roadway or a line parallel to it

median
type: Class
subclass of: longitudinal part of trafficway
comment: A flush or painted median should be 4 or more feet wide between inside roadway edge lines. Medians fewer than 4 feet wide shall have a barrier to be considered a median. Continuous left-turn lanes are not considered painted medians.
definition: An area of a trafficway between parallel roads separating travel in opposite directions.
adapted from: ANSI D.16-2017, section 2.2.29

metro station
type: Class
subclass of: station
definition: station for a rapid transit system, which as a whole is usually called a "metro" or "subway"

municipal road
type: Class
subclass of: ordinary road
definition: road that is part of the road network within municipal jurisdiction

national road
type: Class
subclass of: ordinary road
definition: road that is part of the strategic road network for the nation

natural place
type: Class
subclass of: MaterialEntity
definition: place created by nature to which people come for entertainment

node
type: Class
subclass of: path
disjoint with: path segment
definition: single point in space defined by its latitude, longitude and node ID

one way lane
type: Class
subclass of: lane
definition: lane where driving vehicles otherwise than in one direction is prohibited

ordinary road
type: Class
subclass of: road type
definition: road that is not a highway

other sign
type: Class
subclass of: road surface marking
definition: other sign that can be encountered by the driver on the road

other state route numbered highway
type: Class
subclass of: trafficway
definition: A trafficway within a state trafficway system, but not an interstate highway or other U.S. route numbered highway.
adapted from: ANSI D.16-2017, section 2.5.6

other US route numbered highway another
type: Class
subclass of: trafficway
definition: A trafficway numbered by the American Association of State Highway Officials, but not an interstate highway.
adapted from: ANSI D.16-2017, section 2.5.5

park
type: Class
subclass of: leisure
definition: piece of ground in or near a city or town kept for ornament and recreation

parking lot
type: Class
subclass of: infrastructure
comment: When paved and marked, it commonly includes the following areas : 1.) Parking stalls — areas reserved primarily for parked road vehicles, 2.) Parking lot aisles — areas used primarily for vehicular access to parking stalls, Parking lot aisles are not trafficways. 3.) Parking lot ways — land ways which are used primarily for vehicular circulation within parking lots and for vehicular access to parking lot aisles.
definition: An area used primarily for parking road vehicles.
adapted from: ANSI D.16-2017, section 2.5.22

parking lot way
type: Class
subclass of: trafficway
definition: A parking lots open to the public are trafficways.
adapted from: ANSI D.16-2017, section 2.5.22.1

parking place
type: Class
subclass of: amenity
definition: place to park a car, truck, etc

path
type: Class
subclass of: infrastructure
definition: line of movement of a vehicle

path segment
type: Class
subclass of: path
definition: part of a path that can be an intersection, a lane, a crosswalk or a turn

pharmacy
type: Class
subclass of: shop
definition: place where medicines are compounded or dispensed

police station
type: Class
subclass of: building
definition: headquarters of the police for a locality

post office
type: Class
subclass of: building
definition: local branch of a national post office handling the mail for a particular place or area

prefectural road
type: Class
subclass of: ordinary road
definition: road that is part of the regional arterial road network

private road
type: Class
subclass of: ordinary road
definition: road owned by a private entity

private way
type: Class
subclass of: trafficway
comment: The space within a crossing of a private way and a trafficway shall be considered a trafficway.
definition: Any land way other than a trafficway.
adapted from: ANSI D.16-2017, section 2.2.2

railway
type: Class
subclass of: infrastructure
definition: Any private way reserved primarily for land vehicles moving persons or property from one place to another on rails.
adapted from: ANSI D.16-2017, section 2.2.3

railway station
type: Class
subclass of: station
definition: building containing accommodations for railroad passengers or freight

ramp
type: Class
subclass of: road part
comment: Road Vehicle A road vehicle is any land vehicle other than a railway vehicle.
definition: An auxiliary roadway used for entering or leaving through-traffic lanes.
adapted from: ANSI D.16-2017, section 2.5.17

regulatory road sign
type: Class
subclass of: road sign
comment: Regulatory sign
definition: sign used to inform road users of selected traffic laws or regulations and indicate the applicability of the legal requirements

regulatory surface sign
type: Class
subclass of: road surface marking
definition: sign used to inform road users of selected traffic laws or regulations and indicate the applicability of the legal requirements located on the road surface

residential district
type: Class
subclass of: urban district
definition: territory contiguous to and including a highway not comprising a business district when the property on such highway for a distance of 300 feet or more is in the main improved with residences or residences and buildings in use for business

restaurant
type: Class
subclass of: amenity
definition: business establishment where meals or refreshments may be purchased

river
type: Class
subclass of: natural place
definition: natural stream of water of usually considerable volume

road
type: Class
subclass of: longitudinal part of trafficway
definition: A part of a trafficway which includes both the roadway and any shoulder alongside the roadway.
adapted from: ANSI D.16-2017, section 2.2.33

road part
type: Class
subclass of: infrastructure
subclass of: transport way
definition: part of the road

road segment
type: Class
subclass of: road part
definition: segment of the road

road sign
type: Class
subclass of: traffic sign
definition: sign located on or visible from the road that informs the drivers about laws, attractions, regulations and more

road surface marking
type: Class
subclass of: traffic sign
definition: marking located on the road surface, which informs the drivers about laws, attractions, regulations and more

road type
type: Class
subclass of: infrastructure
definition: particular kind of road

roadside
type: Class
subclass of: longitudinal part of trafficway
definition: The outermost part of the trafficway from the property line or other boundary in to the edge of the first road.
adapted from: ANSI D.16-2017, section 2.2.31

roadway
type: Class
subclass of: longitudinal part of trafficway
comment: Separate roadways may be provided for opposing directions of traffic or for trucks and automobiles.
definition: A part of a trafficway designed, improved and ordinarily used for motor vehicle travel or, where various classes of motor vehicles are segregated, that part of a trafficway used by a particular class.
adapted from: ANSI D.16-2017, section 2.2.28

roundabout
type: Class
subclass of: junction
definition: circular intersection with yield control at entry, which permits a vehicle on the circulatory roadway to proceed, and with deflection of the approaching vehicle counter-clockwise around a central island

school
type: Class
subclass of: educational institute
definition: institution for the teaching of children

separator
type: Class
subclass of: trafficway
definition: The area of a trafficway between parallel roads separating travel in the same direction or separating a frontage road (See 2.5.18) from other roads.
adapted from: ANSI D.16-2017, section 2.2.30

shared road
type: Class
subclass of: bikeway
definition: Any bikeway which is part of a roadway, but not a bicycle lane.
adapted from: ANSI D.16-2017, section 2.2.46

shop
type: Class
subclass of: amenity
definition: small retail establishment or a department in a large one offering a specified line of goods or services

shoulder
type: Class
subclass of: longitudinal part of trafficway
definition: A part of a trafficway contiguous with the roadway for emergency use, for accommodation of stopped road vehicles, and for lateral support of the roadway structure.
adapted from: ANSI D.16-2017, section 2.2.32

speed limit
type: Class
subclass of: QualitativeValue
definition: maximum (or minimum) speed applicable to a section of highway as established by law or regulation

speed limit 100
type: Class
subclass of: speed limit
definition: speed limit of 100 km per hour

speed limit 25
type: Class
subclass of: speed limit
definition: speed limit of 25 km per hour

speed limit 30
type: Class
subclass of: speed limit
definition: speed limit of 30 km per hour

speed limit 40
type: Class
subclass of: speed limit
definition: speed limit of 40 km per hour

speed limit 50
type: Class
subclass of: speed limit
definition: speed limit of 50 km per hour

speed limit 60
type: Class
subclass of: speed limit
definition: speed limit of 60 km per hour

speed limit 70
type: Class
subclass of: speed limit
definition: speed limit of 70 km per hour

speed limit 80
type: Class
subclass of: speed limit
definition: speed limit of 80 km per hour

sports centre
type: Class
subclass of: leisure
definition: place where people take part in sports

start lane
type: Class
subclass of: lane segment
definition: lane located at the start of a path

start node
type: Class
subclass of: node
definition: starting GPS position of a path

station
type: Class
subclass of: infrastructure
definition: regular stopping place on a transportation route

supermarket
type: Class
subclass of: shop
definition: self-service retail market selling especially foods and household merchandise

toll gate
type: Class
subclass of: infrastructure
definition: point where the driver of a vehicle must pay a toll

traffic sign
type: Class
subclass of: infrastructure
definition: road sign, signal, device, notice or road marking that identifies a danger, advises persons of the precautions to be taken against such danger, indicates the existence of a road regulation or implements such a regulation

traffic signal
type: Class
subclass of: Process
definition: device manually, electrically or mechanically operated for the regulation of traffic

trafficway
type: Class
subclass of: transport way
definition: Any land way open to the public as a matter of right or custom for moving persons or property from one place to another.
adapted from: ANSI D.16-2017, section 2.2.1

transport way
type: Class
subclass of: infrastructure
definition: Any way or place reserved or commonly used for the operation of transport vehicles.
adapted from: ANSI D.16-2017, section 2.1.8

turn
type: Class
subclass of: junction
definition: instant change of direction of a singular road

turn lane
type: Class
subclass of: transport way
definition: A lane exclusively designated for vehicles turning from one trafficway to another.
adapted from: ANSI D.16-2017, section 2.5.23

two way lane
type: Class
subclass of: lane
definition: lane allowing for two-way traffic

university
type: Class
subclass of: educational institute
definition: institution of higher learning providing facilities for teaching and research and authorized to grant academic degrees

urban area
type: Class
subclass of: infrastructure
comment: Such boundaries are established in accordance with the provisions of Title 23 of the United States Code. Urban area boundary information is available from state highway or transportation departments. In the event that boundaries have not been fixed as above for any urban place designated by the Bureau of the Census having population of 5000 or more, the area within boundaries fixed by the Bureau of the Census shall be an urban area.
definition: An area whose boundaries shall be those fixed by responsible state and local officials in cooperation with each other and approved by the Federal Highway Administration, U.S. Department of Transportation.
adapted from: ANSI D.16-2017, section 2.5.1

urban district
type: Class
subclass of: infrastructure
definition: territory contiguous to and including any street built up with structures devoted to business, industry or dwelling houses situated at intervals of less than 100 feet for a distance of a quarter of a mile or more

utility pole
type: Class
subclass of: infrastructure
definition: tall pole that is used to support telephone wires, electrical wires, etc

warning road sign
type: Class
subclass of: road sign
comment: Warning sign
definition: sign used to indicate conditions that are actually or potentially hazardous to users of the road

waterway
type: Class
subclass of: infrastructure
definition: A transport way reserved primarily for use by watercraft.
adapted from: ANSI D.16-2017, section 2.1.10

work zone
type: Class
subclass of: infrastructure
comment: It extends from the first warning sign, signal or flashing lights to the END ROAD WORK sign or the last traffic control device pertinent for that work activity. Work zones also include roadway sections where there is ongoing, moving (mobile) work activity such as lane line painting or roadside mowing only if the beginning of the ongoing, moving (mobile) work activity is designated by warning signs or signals.
definition: An area of a trafficway where construction, maintenance or utility work activities are identified by warning signs/signals/indicators, including those on transport devices (e.g., signs, flashing lights, channelizing devices, barriers, pavement markings, flagmen, warning signs and arrow boards mounted on the vehicles in a mobile maintenance activity) that mark the beginning and end of a construction, maintenance or utility work activity.
adapted from: ANSI D.16-2017, section 2.5.24

address
type: DatatypeProperty
domain: infrastructure
range: string
definition: relates an infrastructure to its address

admin area
type: DatatypeProperty
definition: relates a node, an infrastructure or a natural place to its administrative area

allow lane change
type: DatatypeProperty
range: boolean
definition: indicates whether a vehicle can change lanes

allowed direction
type: DatatypeProperty
sub property of: topDataProperty
domain: lane

altitude
type: DatatypeProperty
range: decimal
definition: relates a vehicle or a node to its altitude expressed in meters

angle
type: DatatypeProperty
domain: traffic signal
range: decimal

bound coordinate
type: DatatypeProperty

bound position
type: DatatypeProperty
sub property of: topDataProperty
definition: relates a junction or a road segment with its boundary GPS point

brand
type: DatatypeProperty
range: string
definition: relates a material entity to its brand

curve ID
type: DatatypeProperty
range: string

driving direction
type: DatatypeProperty
sub property of: topDataProperty
domain: lane
definition: relates a lane to its driving direction

enter position
type: DatatypeProperty
sub property of: topDataProperty
domain: lane

exit position
type: DatatypeProperty
sub property of: topDataProperty
domain: lane

go straight to
type: ObjectProperty
definition: relates a vehicle to a road part straight of him, onto which it should go when changing lanes

has car
type: ObjectProperty

has intersection
type: ObjectProperty
sub property of: has junction
domain: road type
range: intersection
definition: relates a road type to an intersection

has junction
type: ObjectProperty
definition: relates a road type to a junction

has lane
type: ObjectProperty
domain: road segment
range: lane
inverse of: is lane of
definition: relates a road segment to a lane it contains

has road segment
type: ObjectProperty
range: road segment
inverse of: is road segment of
definition: relates a road part to a road segment it contains

is connected to
type: ObjectProperty
type: SymmetricProperty
definition: relates a road to a road connected to it

is empty
type: DatatypeProperty
sub property of: topDataProperty
domain: road part
range: boolean
definition: indicates whether a given road part is empty

is lane of
type: ObjectProperty
domain: lane
range: road segment
definition: relates a lane to a road segment which contains said lane

is left of
type: ObjectProperty
inverse of: is right of

is next to
type: ObjectProperty
type: SymmetricProperty
domain: lane
range: lane
definition: relates a lane to a lane next to it

is on
type: ObjectProperty

is right of
type: ObjectProperty

is road segment of
type: ObjectProperty
domain: road segment
definition: relates a road segment to its road part

latitude
type: DatatypeProperty
range: decimal
definition: relates a vehicle or a node to its latitude

location x
type: DatatypeProperty
sub property of: topDataProperty
range: decimal
definition: relates a node to its x coordinate

location y
type: DatatypeProperty
sub property of: topDataProperty
range: decimal
definition: relates a node to its y coordinate

location z
type: DatatypeProperty
sub property of: topDataProperty
range: decimal
definition: relates a node to its z coordinate

longitude
type: DatatypeProperty
range: decimal
definition: relates a vehicle or a node to its longitude

name
type: DatatypeProperty
range: string
definition: relates something to its name

near to
type: ObjectProperty
type: SymmetricProperty

opening hours
type: DatatypeProperty
definition: relates an infrastructure or a natural place to the hours during which it is open

operator
type: DatatypeProperty
domain: infrastructure
range: string

orientation
type: DatatypeProperty
sub property of: topDataProperty

OSM node ID
type: DatatypeProperty
domain: node
range: integer
definition: relates a node to its OpenStreetMap ID

OSM refrence
type: DatatypeProperty
range: string
definition: links a road individual to OpenStreetMap map entity

OSM way ID
type: DatatypeProperty
range: integer
definition: relates a way to its OpenStreetMap ID

phone
type: DatatypeProperty
range: string
definition: relates an infrastructure to its phone number

postcode
type: DatatypeProperty
range: string
definition: relates an infrastructure to its postal code

pub fac admin
type: DatatypeProperty

related traffic light
type: ObjectProperty
definition: links a driver to the traffic lights they should observe on a lane

river ID
type: DatatypeProperty
domain: river
range: string
definition: relates a river to its ID

speed max
type: DatatypeProperty
sub property of: topDataProperty
range: string
definition: relates a lane to the maximum speed a vehicle can legally drive at while on it

turn left to
type: ObjectProperty
definition: relates a vehicle to a road part left of him, onto which it should go when changing lanes

turn right to
type: ObjectProperty
definition: relates a vehicle to a road part right of him, onto which it should go when changing lanes

website
type: DatatypeProperty
range: anyURI
definition: relates an infrastructure or a natural place to its website

Axiom
source: https://www.merriam-webster.com/dictionary/restaurant
annotated property: definition
annotated source: restaurant
annotated target: business establishment where meals or refreshments may be purchased

Axiom
direct source: https://mutcd.fhwa.dot.gov/pdfs/2009r1r2/mutcd2009r1r2edition.pdf
annotated property: definition
annotated source: speed limit
annotated target: maximum (or minimum) speed applicable to a section of highway as established by law or regulation

Axiom
direct source: https://www.collinsdictionary.com/dictionary/english/bus-lane
annotated property: definition
annotated source: bus lane
annotated target: part of the road which is intended to be used only by buses

Axiom
direct source: https://www.collinsdictionary.com/dictionary/english/bus-stop
annotated property: definition
annotated source: bus stop
annotated target: place on a road where buses stop to let passengers on and off

Axiom
direct source: https://www.collinsdictionary.com/dictionary/english/sports-centre
annotated property: definition
annotated source: sports centre
annotated target: place where people take part in sports

Axiom
direct source: https://www.merriam-webster.com/dictionary/college
annotated property: definition
annotated source: college
annotated target: institution offering instruction, usually in a professional, vocational, or technical field

Axiom
direct source: https://www.merriam-webster.com/dictionary/convenience%20store
annotated property: definition
annotated source: convenience
annotated target: small, often franchised market that is open long hours

Axiom
direct source: https://www.merriam-webster.com/dictionary/fire%20station
annotated property: definition
annotated source: fire station
annotated target: building housing fire apparatus and usually firefighters

Axiom
direct source: https://www.merriam-webster.com/dictionary/forest
annotated property: definition
annotated source: forest
annotated target: dense growth of trees and underbrush covering a large tract

Axiom
direct source: https://www.merriam-webster.com/dictionary/gas%20station
annotated property: definition
annotated source: gas station
annotated target: retail station for servicing motor vehicles, especially with gasoline and oil

Axiom
direct source: https://www.merriam-webster.com/dictionary/hospital
annotated property: definition
annotated source: hospital
annotated target: institution where the sick or injured are given medical or surgical care

Axiom
direct source: https://www.merriam-webster.com/dictionary/kindergarten
annotated property: definition
annotated source: kindergarten
annotated target: school or class for children usually from four to six years old

Axiom
direct source: https://www.merriam-webster.com/dictionary/lake
annotated property: definition
annotated source: lake
annotated target: considerable inland body of standing water

Axiom
direct source: https://www.merriam-webster.com/dictionary/park
annotated property: definition
annotated source: park
annotated target: piece of ground in or near a city or town kept for ornament and recreation

Axiom
direct source: https://www.merriam-webster.com/dictionary/parking%20place%2Fspace%2Fspot
annotated property: definition
annotated source: parking place
annotated target: place to park a car, truck, etc

Axiom
direct source: https://www.merriam-webster.com/dictionary/pharmacy
annotated property: definition
annotated source: pharmacy
annotated target: place where medicines are compounded or dispensed

Axiom
direct source: https://www.merriam-webster.com/dictionary/police%20station
annotated property: definition
annotated source: police station
annotated target: headquarters of the police for a locality

Axiom
direct source: https://www.merriam-webster.com/dictionary/post%20office
annotated property: definition
annotated source: post office
annotated target: local branch of a national post office handling the mail for a particular place or area

Axiom
direct source: https://www.merriam-webster.com/dictionary/railroad%20station
annotated property: definition
annotated source: railway station
annotated target: building containing accommodations for railroad passengers or freight

Axiom
direct source: https://www.merriam-webster.com/dictionary/river
annotated property: definition
annotated source: river
annotated target: natural stream of water of usually considerable volume

Axiom
direct source: https://www.merriam-webster.com/dictionary/school
annotated property: definition
annotated source: school
annotated target: institution for the teaching of children

Axiom
direct source: https://www.merriam-webster.com/dictionary/shop
annotated property: definition
annotated source: shop
annotated target: small retail establishment or a department in a large one offering a specified line of goods or services

Axiom
direct source: https://www.merriam-webster.com/dictionary/station
annotated property: definition
annotated source: station
annotated target: regular stopping place on a transportation route

Axiom
direct source: https://www.merriam-webster.com/dictionary/tollgate
annotated property: definition
annotated source: toll gate
annotated target: point where the driver of a vehicle must pay a toll

Axiom
direct source: https://www.merriam-webster.com/dictionary/university
annotated property: definition
annotated source: university
annotated target: institution of higher learning providing facilities for teaching and research and authorized to grant academic degrees

Axiom
direct source: https://www.oregon.gov/ODOT/Forms/DMV/1.pdf
annotated property: definition
annotated source: roundabout
annotated target: circular intersection with yield control at entry, which permits a vehicle on the circulatory roadway to proceed, and with deflection of the approaching vehicle counter-clockwise around a central island

Axiom
annotated property: definition
annotated source: airport
annotated target: place from which aircraft operate that usually has paved runways and maintenance facilities and often serves as a terminal
definition origin: https://www.merriam-webster.com/dictionary/airport

Axiom
annotated property: definition
annotated source: amenity
annotated target: something that helps to provide comfort, convenience, or enjoyment
adapted from: https://www.merriam-webster.com/dictionary/amenity

Axiom
annotated property: definition
annotated source: auxiliary road sign
annotated target: sign that provides information such as direction, time and temperature displays, hours of operation, or warning; auxiliary signs are intended for the convenience of the public. An auxiliary sign may include the business name and/or logo, but may not include its product or services
definition origin: https://www.lawinsider.com/dictionary/auxiliary-sign

Axiom
annotated property: definition
annotated source: bank
annotated target: establishment for the custody, loan, exchange, or issue of money, for the extension of credit, and for facilitating the transmission of funds
definition origin: https://www.merriam-webster.com/dictionary/bank

Axiom
annotated property: definition
annotated source: building
annotated target: usually roofed and walled structure built for permanent use
definition origin: https://www.merriam-webster.com/dictionary/building

Axiom
annotated property: definition
annotated source: bus station
annotated target: place incorporating waiting areas, stands for buses, and ticket offices from which buses or coaches depart
definition origin: https://www.collinsdictionary.com/dictionary/english/bus-station

Axiom
annotated property: definition
annotated source: business district
annotated target: territory contiguous to and including a highway when within any 600 feet along such highway there are buildings in use for business or industrial purposes, including but not limited to hotels, banks, office buildings, railroad stations and public buildings which occupy at least 300 feet of frontage on one side or 300 feet collectively on both sides of the highway
adapted from: https://iamtraffic.org/wp-content/uploads/2013/01/UVC2000.pdf

Axiom
annotated property: definition
annotated source: directional road sign
annotated target: sign installed on public land that advertises the direction to be taken to a service, tourist attraction or a townsite/locality
adapted from: https://www.lawinsider.com/dictionary/directional-signage

Axiom
annotated property: definition
annotated source: fast food
annotated target: restaurant specializing in food that can be prepared and served quickly
adapted from: https://www.merriam-webster.com/dictionary/fast-food

Axiom
annotated property: definition
annotated source: infrastructure
annotated target: basic installations and facilities on which the continuance and growth of a community, state, etc. depend, such as roads, schools, power plants, transportation and communication systems, etc.
adapted from: https://www.collinsdictionary.com/dictionary/english/infrastructure

Axiom
annotated property: definition
annotated source: instruction road sign
annotated target: sign which does not contain advertising or promotional matter but relates solely to traffic or pedestrian control, warnings or hours of operation
adapted from: https://www.lawinsider.com/dictionary/instructional-sign

Axiom
annotated property: definition
annotated source: lane
annotated target: one of the longitudinal strips into which the carriageway is divisible, whether or not defined by longitudinal road markings, which is wide enough for one moving line of motor vehicles other than motorcycles
adapted from: https://unece.org/DAM/trans/conventn/Conv_road_signs_2006v_EN.pdf

Axiom
annotated property: definition
annotated source: leisure
annotated target: large public building containing different facilities for leisure activities
adapted from: https://www.collinsdictionary.com/dictionary/english/leisure-centre

Axiom
annotated property: definition
annotated source: node
annotated target: single point in space defined by its latitude, longitude and node ID
adapted from: https://wiki.openstreetmap.org/wiki/Node

Axiom
annotated property: definition
annotated source: regulatory road sign
annotated target: sign used to inform road users of selected traffic laws or regulations and indicate the applicability of the legal requirements
adapted from: https://mutcd.fhwa.dot.gov/htm/2003/part2/part2b1.htm

Axiom
annotated property: definition
annotated source: residential district
annotated target: territory contiguous to and including a highway not comprising a business district when the property on such highway for a distance of 300 feet or more is in the main improved with residences or residences and buildings in use for business
adapted from: https://iamtraffic.org/wp-content/uploads/2013/01/UVC2000.pdf

Axiom
annotated property: definition
annotated source: supermarket
annotated target: self-service retail market selling especially foods and household merchandise
adapted from: https://www.merriam-webster.com/dictionary/supermarket

Axiom
annotated property: definition
annotated source: traffic signal
annotated target: device manually, electrically or mechanically operated for the regulation of traffic
adapted from: https://www.lawinsider.com/dictionary/traffic-signal

Axiom
annotated property: definition
annotated source: urban district
annotated target: territory contiguous to and including any street built up with structures devoted to business, industry or dwelling houses situated at intervals of less than 100 feet for a distance of a quarter of a mile or more
adapted from: https://iamtraffic.org/wp-content/uploads/2013/01/UVC2000.pdf

Axiom
annotated property: definition
annotated source: utility pole
annotated target: tall pole that is used to support telephone wires, electrical wires, etc
adapted from: https://www.merriam-webster.com/dictionary/utility%20pole