Vehicle core ontology (VC)
type: Ontology
contributor: Robert Trypuz
abstract: The Vehicle Core (VC) module focuses on the core concepts related to vehicles' types, structure and configuration. It contains many classes and properties extracted from: - the automotive extension of schema.org (https://schema.org/docs/automotive.html). - the Volkswagen Vehicles Ontology created by Martin Hepp with the contribution of Charles Sandeman-Craik, Tribal DDB; Chris Jenkins, Tribal DDB; Tim Redding, Tribal DDB; Yago Otero, Tribal DDB; William Greenly, Tribal DDB; Robin Dingle, Volkswagen UK (see https://lov.linkeddata.es/dataset/lov/vocabs/vvo) and available under the Creative Commons Attribution 3.0 Unported license (see http://creativecommons.org/licenses/by/3.0/). - the Car Options Ontology (COO) created by Martin Hepp, Hepp Research GmbH, with the contribution of Charles Sandeman-Craik, Tribal DDB; Chris Jenkins, Tribal DDB; Tim Redding, Tribal DDB; Yago Otero, Tribal DDB; William Greenly, Tribal DDB; Robin Dingle, Volkswagen UK (see https://lov.linkeddata.es/dataset/lov/vocabs/coo) and available under the Creative Commons Attribution 3.0 Unported license (see http://creativecommons.org/licenses/by/3.0/). - the Vehicle Emissions Ontology (VEO) created by Bojan Najdenov, with the contribution of Milos Jovanovik (see https://lov.linkeddata.es/dataset/lov/vocabs/veo) and available under the Creative Commons Attribution 3.0 Unported license (see http://creativecommons.org/licenses/by/3.0/). - the Car Ontology (CAR) created by Lihua Zhao and Yutaka Sasaki at the Computational Intelligence Laboratory, Toyota Technological Institute, Nagoya, Japan (see https://www.toyota-ti.ac.jp/Lab/Denshi/COIN/Ontology/TTICore-0.03/) and published by the Toyota Technological Institute Smart Vehicle Research Project. MAP, as created by the Computational Intelligence Laboratory, is available under the Creative Commons - Attribution-NonCommercial-ShareAlike 4.0 International (http://creativecommons.org/licenses/by-nc-sa/4.0/). - the Used Cars Ontology (UCO) (created by Hepp R…
content language: http://www.w3.org/standards/techs/owl#w3c_all
copyright: Copyright (c) 2021 EDM Council, Inc.
file abbreviation: auto-vc-vc
filename: VehicleCore.rdf
imports: MiddleOntology
imports: AnnotationVocabulary
version IRI: VehicleCore
has maturity level: Provisional

generically dependent continuant
type: Class

independent continuant
type: Class

location
type: Class

model
type: Class

numerical value
type: Class

object
type: Class

organization
type: Class

person
type: Class
comment: Within the context of this manual, a fetus is considered part of a pregnant woman rather than a separate individual. After death, a human body is not considered to be a person.
definition: Any living human.
adapted from: ANSI D.16-2017, section 2.1.1

postal address
type: Class

process
type: Class

property value
type: Class
subclass of: Restriction
  on property: property ID
  min cardinality: 0
subclass of: Restriction
  on property: property name
  min cardinality: 0
subclass of: Restriction
  on property: property value
  min cardinality: 0
subclass of: Restriction
  on property: unit text
  min cardinality: 0
subclass of: Restriction
  on property: unit code
  min qualified cardinality: 0
  on data range: string

qualitative value
type: Class
is part of: auto.schema.org
source: Automotive Ontology Working Group
direct source: QualitativeValue
definition: a predefined value for a product characteristic, e.g. the power cord plug type 'US' or the garment sizes 'S', 'M', 'L', and 'XL'

quality
type: Class

quantitative value
type: Class
subclass of: Class
  intersection of: Restriction
    on property: rotational speed reference
    on class: quantitative value
    min qualified cardinality: 0
  intersection of: Restriction
    on property: rotational speed reference
    on class: quantitative value
    max qualified cardinality: 1
subclass of: Class
  intersection of: Restriction
    on property: refers to traffic pattern
    on class: traffic pattern value
    min qualified cardinality: 0
  intersection of: Restriction
    on property: refers to traffic pattern
    on class: traffic pattern value
    max qualified cardinality: 1
is part of: auto.schema.org
source: Automotive Ontology Working Group
direct source: QuantitativeValue
definition: a point value or interval for product characteristics and other purposes

quantitative value float
type: Class
subclass of: Class
  intersection of: Restriction
    on property: reference distance
    on class: quantitative value
    min qualified cardinality: 0
  intersection of: Restriction
    on property: reference distance
    on class: quantitative value
    max qualified cardinality: 1
subclass of: Class
  intersection of: Restriction
    on property: reference fuel quantity
    on class: fuel quantity
    min qualified cardinality: 0
  intersection of: Restriction
    on property: reference fuel quantity
    on class: fuel quantity
    max qualified cardinality: 1

role
type: Class

text value
type: Class

value space
type: Class

datatype product or service property
type: DatatypeProperty

has max value
type: DatatypeProperty

has min value
type: DatatypeProperty

has unit of measurement
type: DatatypeProperty
domain: quantitative value

value reference
type: ObjectProperty

0 to 100KMH
type: NamedIndividual
type: speed interval
definition: The speed interval from 0 to 100 km/h
has max value: 100.0
has min value: 0.0
has unit of measurement: KMH

0 to 60MPH
type: NamedIndividual
type: speed interval
definition: The speed interval from 0 to 60 mph
has max value: 60.0
has min value: 0.0
has unit of measurement: HM

1GLI
type: NamedIndividual
type: fuel quantity
definition: The fuel quantity of 1 British (imperial) gallon
has unit of measurement: GLI

1GLL
type: NamedIndividual
type: fuel quantity
definition: The fuel quantity of 1 US gallon
has unit of measurement: GLL

1LTR
type: NamedIndividual
type: fuel quantity
definition: The fuel quantity of 1 liter
has unit of measurement: LTR

agricultural commodity trailer
type: Class
subclass of: full trailer
definition: trailer that is designed to transport bulk agricultural commodities in off-road harvesting sites and to a processing plant or storage location, as evidenced by skeletal construction that accommodates harvest containers, a maximum length of 28 feet, and an arrangement of air control lines and reservoirs that minimizes damage in field operations

aircraft
type: Class
subclass of: vehicle
definition: A transport vehicle designed primarily for, or in use for, moving persons or property through the air from one place to another.
adapted from: ANSI D.16-2017, section 2.1.5

all-wheel drive
type: NamedIndividual
type: drive wheel configuration value
definition: All-wheel Drive is a transmission layout where the engine drives all four wheels.

audio and navigation choice or component
type: Class
subclass of: choice or component
definition: The class of audio and navigation choices or components (CD/DVD/SatNav, a "MonoSelectGroup" in automotive terminology), VW ID: 1

authorized dealer
type: NamedIndividual
type: business entity type
definition: An authorized dealer of the manufacturer of the respective vehicle

autocycle
type: Class
subclass of: motorcycle
definition: A large motorcycle with one rear wheel and two front wheels, with either a saddle and handlebars or seat (s) and a steering wheel, that can be fully enclosed, partially enclosed, or unenclosed.
adapted from: ANSI D.16-2017, section 2.2.9.7

base model
type: Class
subclass of: model
subclass of: Restriction
  on property: has trim
  on class: trim
  min qualified cardinality: 0
disjoint with: choice or component
disjoint with: complete car model
disjoint with: configuration info
disjoint with: derivative
disjoint with: property speciﬁcation
disjoint with: spec item collection
disjoint with: trim
definition: A Base Model is an abstract entity specifying the basic features of a group of vehicles. Examples: VW Golf, VW Polo, VW Passat

bicycle
type: Class
subclass of: pedalcycle
label: rower @pl
comment: QName: auto-vc-vc:Bicycle
comment: pojazd o szerokości nieprzekraczającej 0,9 m poruszany siłą mięśni osoby jadącej tym pojazdem; rower może być wyposażony w uruchamiany naciskiem na pedały pomocniczy napęd elektryczny zasilany prądem o napięciu nie wyższym niż 48 V o znamionowej mocy ciągłej nie większej niż 250 W, którego moc wyjściowa zmniejsza się stopniowo i spada do zera po przekroczeniu prędkości 25 km/h @pl
definition: a pedal-driven, human-powered, single-track vehicle, having two wheels attached to a frame, one behind the other. Some bicycles have a small combustion or electric engine that assists with the pedaling.
synonym: bike

boat
type: Class
subclass of: watercraft
definition: a watercraft of modest size designed to float or plane, to provide passage across water

boat trailer
type: Class
subclass of: full trailer
definition: trailer designed with cradle-type mountings to transport a boat and configured to permit the launching of the boat from the rear of the trailer

4 X 4
type: NamedIndividual
type: body style value
source: vso:BodyStyleValue
definition: Four-by-Four Vehicle, VW ID: 6
has ID: 6

cabriolet
type: NamedIndividual
type: body style value
source: vso:BodyStyleValue
definition: Cabriolet, VW ID: 4
has ID: 4

coupe
type: NamedIndividual
type: body style value
source: vso:BodyStyleValue
definition: Coupe, VW ID: 7
has ID: 7

estate
type: NamedIndividual
type: body style value
source: vso:BodyStyleValue
definition: Estate, VW ID: 3
has ID: 3

hatchback
type: NamedIndividual
type: body style value
source: vso:BodyStyleValue
definition: Hatchback, VW ID: 1
has ID: 1

MPV
type: NamedIndividual
type: body style value
source: vso:BodyStyleValue
definition: Multi-purpose Vehicle, VW ID: 5
has ID: 5

saloon
type: NamedIndividual
type: body style value
source: vso:BodyStyleValue
definition: Saloon, VW ID: 2
has ID: 2

unspecified
type: NamedIndividual
type: body style value
source: vso:BodyStyleValue
definition: Unspecified, VW ID: 0
has ID: 0

body style value
type: Class
subclass of: qualitative value
comment: You can safely use any reasonable DBPedia URI, e.g. http://dbpedia.org/resource/Convertible http://dbpedia.org/resource/Hatchback http://dbpedia.org/resource/Station_wagon http://dbpedia.org/resource/Sport_utility_vehicle http://dbpedia.org/resource/Roadster
definition: a value indicating the body style of a vehicle

bus
type: Class
subclass of: large special vehicle
subclass of: Restriction
  on property: acriss code
  min qualified cardinality: 0
  on data range: string
label: autobus @pl
comment: A bus (also omnibus or autobus) is a road vehicle designed to carry passengers. Buses have a capacity as high as 300 passengers and are widely used for public transportation. Coaches are luxury busses, usually in service for long distance travel.
comment: QName: auto-vc-vc:BusOrCoach
comment: pojazd samochodowy przeznaczony konstrukcyjnie do przewozu więcej niż 9 osób łącznie z kierowcą @pl
is part of: auto.schema.org
source: Automotive Ontology Working Group
direct source: BusOrCoach
definition: A motor vehicle with seating for transporting nine or more persons, including the driver.
definition: a road vehicle designed to carry passengers. Coaches are luxury busses, usually in service for long distance travel
adapted from: ANSI D.16-2017, section 2.2.10
synonym: autobus
synonym: coach
synonym: omnibus

business
type: NamedIndividual
type: car usage
definition: The usage of a vehicle for general business purposes, i.e. excluding usages like as a taxi, rental car, or driving instructions.

business entity
type: Class
subclass of: independent continuant
equivalent class: Class
  union of: organization
  union of: person
definition: entity that is formed and administered as per commercial law in order to engage in business activities

business entity type
type: Class
subclass of: qualitative value
definition: type of a business entity

canoe
type: Class
subclass of: boat
definition: a small narrow boat, typically human-powered, though it may also be powered by sails or small electric or gas motors

car
type: Class
subclass of: motorized road vehicle
subclass of: Restriction
  on property: acriss code
  min qualified cardinality: 0
  on data range: string
subclass of: Restriction
  on property: body style
  on class: body style value
  qualified cardinality: 1
label: samochód @pl
comment: Automobiles may be classified by size or weight, or both. Size classification is based on wheelbase. Weight classification is based on curb weight, the weight of an automobile with standard equipment and a full complement of fuel and other fluids, but with no load of persons or property. Before classification, wheelbase should be rounded to the nearest inch and curb weight should be rounded to the nearest 100 pounds.
comment: QName: auto-vc-vc:Car
is part of: auto.schema.org
source: Automotive Ontology Working Group
direct source: Car
definition: A motor vehicle other than a motorcycle, utility vehicle or low speed vehicle consisting of a transport device typically designed for carrying eight or fewer persons.
definition: a wheeled motor vehicle used for transporting passengers, which also carries its own engine or motor
definition: a wheeled, self-powered motor vehicle used for transportation
adapted from: ANSI D.16-2017, section 2.2.12
synonym: automobile

car sharing
type: NamedIndividual
type: car usage
definition: The usage of a vehicle for car sharing networks

car usage
type: Class
subclass of: qualitative value
is part of: auto.schema.org
source: Automotive Ontology Working Group
direct source: CarUsageType
definition: a special usage of a car, e.g. commercial rental, driving school, or as a taxi

cargo van
type: Class
subclass of: van
definition: Any van where the area behind the driver or cab is designed for transporting cargo or operated for general commercial use.
adapted from: ANSI D.16-2017, section 2.2.14.2

carport
type: NamedIndividual
type: parking type
definition: The parking of a vehicle under a protective roof, e.g. in a carport

charter bus
type: Class
subclass of: bus
definition: A bus providing contract service for a group tour or outing, usually on a round-trip basis.
adapted from: ANSI D.16-2017, section 2.2.10.5

check
type: Class
subclass of: process
subclass of: Restriction
  on property: carried out by
  on class: Class
    union of: organization
    union of: person
    union of: business entity type
  min qualified cardinality: 0
definition: a mandatory or optional technical inspection, e.g. the MOT, a vendor-specific certification of used cars, etc.

choice or component
type: Class
subclass of: generically dependent continuant
subclass of: model
subclass of: Class
  intersection of: Restriction
    on property: price modiﬁer
    on class: relative price specification
    min qualified cardinality: 0
  intersection of: Restriction
    on property: price modiﬁer
    on class: relative price specification
    max qualified cardinality: 1
subclass of: Class
  intersection of: Restriction
    on property: display position
    min qualified cardinality: 0
    on data range: int
  intersection of: Restriction
    on property: display position
    max qualified cardinality: 1
    on data range: int
subclass of: Class
  intersection of: Restriction
    on property: product code
    min qualified cardinality: 0
    on data range: string
  intersection of: Restriction
    on property: product code
    max qualified cardinality: 1
    on data range: string
subclass of: Restriction
  on property: compatible with
  on class: choice or component
  min qualified cardinality: 0
subclass of: Restriction
  on property: depends on
  on class: choice or component
  min qualified cardinality: 0
subclass of: Restriction
  on property: includes
  on class: choice or component
  min qualified cardinality: 0
subclass of: Restriction
  on property: incompatible with
  on class: choice or component
  min qualified cardinality: 0
subclass of: Restriction
  on property: feature override
  on class: property speciﬁcation
  min qualified cardinality: 0
disjoint with: complete car model
disjoint with: configuration info
disjoint with: derivative
disjoint with: property speciﬁcation
disjoint with: spec item collection
disjoint with: trim
definition: A Choice or Component is a component (e.g. engine), add-on, feature (color "ocean blue"), or service that can be chosen to be part of a final vehicle configuration. Example: Engine 1.6 l TDI, color ocean blue, trailer hitch

combined
type: NamedIndividual
type: traffic pattern value
source: vvo:TrafficPattern
definition: Combined usage as a traffic pattern

commercial motor vehicle
type: Class
subclass of: transport vehicle
definition: Any motor vehicle used for the transportation of goods, property or people in interstate (See 2.9.2) or intrastate (2.9.3) commerce.
adapted from: ANSI D.16-2017, section 2.2.7.3

complete car model
type: Class
subclass of: model
subclass of: Restriction
  on property: has spec item choice
  on class: choice or component
  min qualified cardinality: 0
disjoint with: configuration info
disjoint with: derivative
disjoint with: property speciﬁcation
disjoint with: spec item collection
disjoint with: trim
definition: A Complete Car Model is an abstract entity specifying all features and configuration choices needed for actually producing a vehicle. In other words, it is the gr:ProductOrServiceModel ("datasheet") for a completely configured vehicle. While a Complete Car Model can be defined indepently of a Base Model, Trim, or Derivative, it is usually based on a Derivative plus choices for all mandatory configurational options (coo:SpecItemCollection) of that Derivative. A Complete Car Model should be linked to its Derivative via gr:isVariantOf, if available. Example: VW Golf S 1.6 TDI 3door Manual in ocean blue with air-conditioning, CD player, trailer hitch, power steering, and power windows Note: A coo:CompleteCarModel is NOT an actual car, but a complete feature description of one or multiple actual cars.

configuration info
type: Class
subclass of: generically dependent continuant
subclass of: Restriction
  on property: feature override
  on class: property speciﬁcation
  min qualified cardinality: 0
subclass of: Restriction
  on property: valid
  on data range: boolean
  qualified cardinality: 1
subclass of: Restriction
  on property: includes choices
  some values from: choice or component
disjoint with: derivative
disjoint with: property speciﬁcation
disjoint with: spec item collection
disjoint with: trim
definition: A Configuration Info is an abstract entity that gives information on whether a set of Choices Or Components results in a valid configuration. Using coo:compatible, it is possible to indicate either compatibility (true) and incompatibility (false) so that modeling remains efficient, no matter whether most combinations are valid or whether most configurations are invalid. If no such statement is found, the validity of a configuration is unknown. Note: The two properties coo:includes and coo:dependsOn, attached to coo:ChoiceOrComponent, may contain additional information on the validity of configuration.

container chassis trailer
type: Class
subclass of: semitrailer
definition: semitrailer of skeleton construction limited to a bottom frame, one or more axles, specially built and fitted with locking devices for the transport of intermodal cargo containers so that when the chassis and container are assembled, the units serve the same function as an over the road trailer

covered farm vehicle
type: Class
subclass of: special vehicle
definition: straight truck or articulated vehicle that is registered in a State with a license plate or other designation issued by the State of registration that allows law enforcement officials to identify it as a farm vehicle and used to transport agricultural commodities, livestock, machinery or supplies to or from a farm or ranch

crib-type log trailer
type: Class
subclass of: full trailer
definition: trailer equipped with stakes, bunks, a front-end structure, and a rear structure to restrain logs

damage or accident
type: Class
subclass of: process
subclass of: Restriction
  on property: carried out by
  on class: Class
    union of: business entity
    union of: business entity type
  min qualified cardinality: 0
subclass of: Restriction
  on property: airbag deployment
  min qualified cardinality: 0
  on data range: boolean
subclass of: Restriction
  on property: not-at-fault accident
  min qualified cardinality: 0
  on data range: boolean
subclass of: Restriction
  on property: original parts only
  min qualified cardinality: 0
  on data range: boolean
subclass of: Restriction
  on property: repaired
  min qualified cardinality: 0
  on data range: boolean
subclass of: Restriction
  on property: structural damage
  min qualified cardinality: 0
  on data range: boolean
definition: an event in which the vehicle is being damaged

decorative trims choice or component
type: Class
subclass of: choice or component
definition: The class of decorative trim choices or components (a "MonoSelectGroup" in automotive terminology), VW ID: 8

derivative
type: Class
subclass of: model
subclass of: Class
  intersection of: Restriction
    on property: cap code
    min qualified cardinality: 0
    on data range: string
  intersection of: Restriction
    on property: cap code
    max qualified cardinality: 1
    on data range: string
subclass of: Class
  intersection of: Restriction
    on property: dh code
    min qualified cardinality: 0
    on data range: string
  intersection of: Restriction
    on property: dh code
    max qualified cardinality: 1
    on data range: string
subclass of: Restriction
  on property: has complete car model
  on class: complete car model
  min qualified cardinality: 0
subclass of: Restriction
  on property: compatibility
  on class: configuration info
  min qualified cardinality: 0
subclass of: Restriction
  on property: has spec items
  on class: spec item collection
  min qualified cardinality: 0
disjoint with: property speciﬁcation
disjoint with: spec item collection
disjoint with: trim
definition: A Derivative is an abstract entity specifying (1) the basic features plus (2) a set of functional (e.g. engine type) and non-functional configuration (e.g. upholstery) choices of a group of vehicles. A Derivative has often a number of remaining configuration choices (coo:SpecItemCollection attached via coo:hasSpecItems), which will determine the actual properties of the resulting vehicle. A Derivative should be linked to its Trim via gr:isVariantOf, if available. Examples: VW Golf S 1.6 TDI 3door Manual

diesel
type: NamedIndividual
type: fuel type value
source: vso:FuelTypeValue
definition: Diesel, VW ID: 2
has ID: 2

drive wheel configuration value
type: Class
subclass of: qualitative value
is part of: auto.schema.org
source: Automotive Ontology Working Group
direct source: DriveWheelConfigurationValue
definition: a value indicating which roadwheels will receive torque

driving school vehicle usage
type: NamedIndividual
type: car usage
is part of: auto.schema.org
source: Automotive Ontology Working Group
definition: Indicates the usage of the vehicle for driving school.

emission standard value
type: Class
subclass of: qualitative value
comment: You can safely use any reasonable DBPedia URI, e.g. http://dbpedia.org/resource/Super_Ultra_Low_Emission_Vehicle http://dbpedia.org/resource/Partial_zero-emissions_vehicle See also http://en.wikipedia.org/wiki/Emissions_standard. Unfortunately, there are no DBPedia identifiers for the popular Euro 1 - Euro 5 standards available. If you cannot find a suitable identifier in DBPedia, define your own as an instance of vso:EmissionStandardValue.
definition: a value indicating the an emission standard

engine choice or component
type: Class
subclass of: choice or component
subclass of: Class
  intersection of: Restriction
    on property: cylinder type id
    min qualified cardinality: 0
    on data range: string
  intersection of: Restriction
    on property: cylinder type id
    max qualified cardinality: 1
    on data range: string
subclass of: Class
  intersection of: Restriction
    on property: fuel injection type id
    min qualified cardinality: 0
    on data range: string
  intersection of: Restriction
    on property: fuel injection type id
    max qualified cardinality: 1
    on data range: string
definition: The class of engines as choices or components

engine specification
type: Class
subclass of: generically dependent continuant
subclass of: Restriction
  on property: engine type
  on class: qualitative value
  min qualified cardinality: 0
subclass of: Restriction
  on property: engine displacement
  on class: quantitative value
  min qualified cardinality: 0
subclass of: Restriction
  on property: engine power
  on class: quantitative value
  min qualified cardinality: 0
subclass of: Restriction
  on property: torque
  on class: quantitative value
  min qualified cardinality: 0
subclass of: Restriction
  on property: fuel type
  some values from: Class
    union of: qualitative value
    union of: text value
is part of: auto.schema.org
source: Automotive Ontology Working Group
direct source: EngineSpecification
definition: information about the engine of the vehicle. A vehicle can have multiple engines represented by multiple engine specification entities

engine type value
type: Class
subclass of: qualitative value
comment: You can safely use any reasonable DBPedia URI, e.g. http://dbpedia.org/resource/Two-stroke_engine http://dbpedia.org/resource/Four-stroke_engine http://dbpedia.org/resource/Wankel_engine http://dbpedia.org/resource/Electric_motor
definition: a value indicating an engine type

Euro 1
type: NamedIndividual
type: emission standard value
source: vso:EmissionStandardValue
definition: The emission standard EURO 1

Euro 2
type: NamedIndividual
type: emission standard value
source: vso:EmissionStandardValue
definition: The emission standard EURO 2

Euro 3
type: NamedIndividual
type: emission standard value
source: vso:EmissionStandardValue
definition: The emission standard EURO 3

Euro 4
type: NamedIndividual
type: emission standard value
source: vso:EmissionStandardValue
definition: The emission standard EURO 4

extra urban
type: NamedIndividual
type: traffic pattern value
source: vvo:TrafficPattern
definition: Extra urban as a traffic pattern

feature value
type: Class
subclass of: qualitative value
comment: You can safely use any reasonable DBPedia URI, e.g. http://dbpedia.org/resource/Anti-lock_braking_system http://dbpedia.org/resource/Electronic_stability_control http://dbpedia.org/resource/Armrest http://dbpedia.org/resource/Spoiler_%28automotive%29 http://dbpedia.org/resource/CD_Changer http://dbpedia.org/resource/Cup_holder http://dbpedia.org/resource/Tow_hitch http://dbpedia.org/resource/Power_window http://dbpedia.org/resource/Power_steering http://dbpedia.org/resource/Air_conditioner http://dbpedia.org/resource/Child_safety_lock http://dbpedia.org/resource/Parking_sensors
definition: a value indicating the features or accessories that are attached to or belong to a vehicle

financing
type: Class
subclass of: payment method
subclass of: Class
  intersection of: Restriction
    on property: advanced payment
    on class: price specification
    min qualified cardinality: 0
  intersection of: Restriction
    on property: advanced payment
    on class: price specification
    max qualified cardinality: 1
subclass of: Class
  intersection of: Restriction
    on property: credit
    on class: price specification
    min qualified cardinality: 0
  intersection of: Restriction
    on property: credit
    on class: price specification
    max qualified cardinality: 1
subclass of: Class
  intersection of: Restriction
    on property: customer cash price
    on class: price specification
    min qualified cardinality: 0
  intersection of: Restriction
    on property: customer cash price
    on class: price specification
    max qualified cardinality: 1
subclass of: Class
  intersection of: Restriction
    on property: customer deposit
    on class: price specification
    min qualified cardinality: 0
  intersection of: Restriction
    on property: customer deposit
    on class: price specification
    max qualified cardinality: 1
subclass of: Class
  intersection of: Restriction
    on property: deposit contribution
    on class: price specification
    min qualified cardinality: 0
  intersection of: Restriction
    on property: deposit contribution
    on class: price specification
    max qualified cardinality: 1
subclass of: Class
  intersection of: Restriction
    on property: discount
    on class: price specification
    min qualified cardinality: 0
  intersection of: Restriction
    on property: discount
    on class: price specification
    max qualified cardinality: 1
subclass of: Class
  intersection of: Restriction
    on property: excess mileage
    on class: price specification
    min qualified cardinality: 0
  intersection of: Restriction
    on property: excess mileage
    on class: price specification
    max qualified cardinality: 1
subclass of: Class
  intersection of: Restriction
    on property: final payment fee
    on class: price specification
    min qualified cardinality: 0
  intersection of: Restriction
    on property: final payment fee
    on class: price specification
    max qualified cardinality: 1
subclass of: Class
  intersection of: Restriction
    on property: first monthly payment fee
    on class: price specification
    min qualified cardinality: 0
  intersection of: Restriction
    on property: first monthly payment fee
    on class: price specification
    max qualified cardinality: 1
subclass of: Class
  intersection of: Restriction
    on property: monthly payment
    on class: price specification
    min qualified cardinality: 0
  intersection of: Restriction
    on property: monthly payment
    on class: price specification
    max qualified cardinality: 1
subclass of: Class
  intersection of: Restriction
    on property: otr retail price
    on class: price specification
    min qualified cardinality: 0
  intersection of: Restriction
    on property: otr retail price
    on class: price specification
    max qualified cardinality: 1
subclass of: Class
  intersection of: Restriction
    on property: scrappage contribution
    on class: price specification
    min qualified cardinality: 0
  intersection of: Restriction
    on property: scrappage contribution
    on class: price specification
    max qualified cardinality: 1
subclass of: Class
  intersection of: Restriction
    on property: total payable
    on class: price specification
    min qualified cardinality: 0
  intersection of: Restriction
    on property: total payable
    on class: price specification
    max qualified cardinality: 1
subclass of: Class
  intersection of: Restriction
    on property: short subtitle
    min qualified cardinality: 0
    on data range: PlainLiteral
  intersection of: Restriction
    on property: short subtitle
    max qualified cardinality: 1
    on data range: PlainLiteral
subclass of: Class
  intersection of: Restriction
    on property: short title
    min qualified cardinality: 0
    on data range: PlainLiteral
  intersection of: Restriction
    on property: short title
    max qualified cardinality: 1
    on data range: PlainLiteral
subclass of: Class
  intersection of: Restriction
    on property: subtitle
    min qualified cardinality: 0
    on data range: PlainLiteral
  intersection of: Restriction
    on property: subtitle
    max qualified cardinality: 1
    on data range: PlainLiteral
subclass of: Class
  intersection of: Restriction
    on property: terms and conditions
    min qualified cardinality: 0
    on data range: PlainLiteral
  intersection of: Restriction
    on property: terms and conditions
    max qualified cardinality: 1
    on data range: PlainLiteral
subclass of: Class
  intersection of: Restriction
    on property: apr
    min qualified cardinality: 0
    on data range: decimal
  intersection of: Restriction
    on property: apr
    max qualified cardinality: 1
    on data range: decimal
subclass of: Class
  intersection of: Restriction
    on property: final payment
    min qualified cardinality: 0
    on data range: decimal
  intersection of: Restriction
    on property: final payment
    max qualified cardinality: 1
    on data range: decimal
subclass of: Class
  intersection of: Restriction
    on property: number of monthly payments
    min qualified cardinality: 0
    on data range: decimal
  intersection of: Restriction
    on property: number of monthly payments
    max qualified cardinality: 1
    on data range: decimal
definition: the specification of a payment option via staged payments

four-wheel drive
type: NamedIndividual
type: drive wheel configuration value
definition: Four-wheel Drive is a transmission layout where the engine primarily drives two wheels with a part-time four-wheel drive capability.

front-wheel drive
type: NamedIndividual
type: drive wheel configuration value
definition: Front-wheel drive is a transmission layout where the engine drives the front wheels.
synonym: FWD

fuel quantity
type: Class
subclass of: quantitative value float
definition: a value indicating an amount of fuel

fuel type value
type: Class
subclass of: qualitative value
comment: You can safely use any reasonable DBPedia URI, e.g. http://dbpedia.org/resource/Gasoline http://dbpedia.org/resource/Diesel http://dbpedia.org/resource/Biodiesel http://dbpedia.org/resource/Kerosene
definition: a value indicating a type of fuel

full trailer
type: Class
subclass of: trailer
comment: An auxiliary undercarriage assembly, commonly known as a converter dolly and consisting of a chassis, fifth wheel and one or more tow bars, is sometimes used to convert a semitrailer to a full trailer. A semitrailer equipped with a converter dolly is considered to be a full trailer.
definition: A trailer, other than a pole trailer, designed for carrying property and so constructed that no part of its weight rests upon or is carried by the towing road vehicle.
adapted from: ANSI D.16-2017, section 2.2.18

garage
type: NamedIndividual
type: parking type
definition: The parking of a vehicle in a closed garage

automatic
type: NamedIndividual
type: gearbox type value
source: vvo:GearboxTypeValue
definition: Automatic gearbox, VW ID: 2
has ID: 2

DSG
type: NamedIndividual
type: gearbox type value
source: vvo:GearboxTypeValue
definition: DSG gearbox, VW ID: 3
has ID: 3

manual
type: NamedIndividual
type: gearbox type value
source: vvo:GearboxTypeValue
definition: Manual gearbox, VW ID: 1
has ID: 1

gearbox type value
type: Class
subclass of: qualitative value
definition: A value indicating a gearbox type.

heavy hauler trailer
type: Class
subclass of: full trailer
definition: trailer whose brakes lines are designed to adapt to separation or extension of the vehicle frame and/or which body consists only of a platform whose primary cargo-carrying surface is not more than 1,016 mm (40 inches) above the ground in an unloaded condition, except that it may include sides that are designed to be easily removable and a permanent “front-end structure”, but that is not a container chassis trailer

heavy truck
type: Class
subclass of: truck
definition: A truck which has a gross vehicle weight rating (GVWR) of more than 26,000 pounds (11,793 kilograms).
adapted from: ANSI D.16-2017, section 2.2.26

road construction controlled horizontal discharge trailer
type: Class
subclass of: full trailer
definition: trailer or semitrailer that is equipped with a mechanical drive and a conveyor to deliver asphalt and other road building materials, in a controlled horizontal manner, into a lay down machine or paving equipment for road construction and paving operations

human powered land vehicle
type: Class
subclass of: road vehicle
definition: land vehicle propelled over ground by human power

hybrid
type: NamedIndividual
type: fuel type value
source: vso:FuelTypeValue
definition: Hybrid, VW ID: 3
has ID: 3

independent dealer
type: NamedIndividual
type: business entity type
definition: An independent dealer

intercity bus
type: Class
subclass of: bus
definition: A bus used for long-distance passenger transportation between cities over fixed routes with regular schedules.
adapted from: ANSI D.16-2017, section 2.2.10.4

kayak
type: Class
subclass of: watercraft
definition: a small human-powered watercraft that traditionally has a covered deck, and one or more cockpits, each seating one paddler who strokes a double-bladed paddle. In this ontology, kayaks are considered watercrafts of their own kind, not a subtype of boat

land vehicle
type: Class
subclass of: vehicle
comment: QName: auto-vc-vc:LandVehicle
definition: A transport vehicle which is neither an aircraft nor a watercraft.
adapted from: ANSI D.16-2017, section 2.1.7

large bus
type: Class
subclass of: bus
definition: A bus with seating for sixteen or more persons, including the driver.
adapted from: ANSI D.16-2017, section 2.2.10.2

large motorcycle
type: Class
subclass of: motorcycle
definition: Any motorcycle other than a motor-driven cycle.
adapted from: ANSI D.16-2017, section 2.2.9.2

large special vehicle
type: Class
subclass of: special vehicle
label: duży pojazd specjalny @pl
see also: source: https://www.toyota-ti.ac.jp/Lab/Denshi/COIN/Ontology/TTICore-0.03/TTICarOnto.owl
definition: special vehicle which is considered large

left hand drive
type: NamedIndividual
type: steering position value
definition: The steering position is on the left side of the vehicle (viewed from the main direction of driving). For cars this means that you drive on the right side of the road.

light truck
type: Class
subclass of: truck
definition: A truck which has a gross vehicle weight rating (GVWR) of 10,000 pounds (4,536 kilograms) or less
adapted from: ANSI D.16-2017, section 2.2.24

low speed vehicle
type: Class
subclass of: car
comment: LSVs are required to be equipped with basic items of safety equipment: headlamps, stop lamps, turn signal lamps, tail lamps, reflex reflectors, parking brake, windshields of either type AS-1 or AS-5 glazing, rearview mirrors, seat belts and vehicle identification numbers (VINs).
definition: A motor vehicle with four or more wheels whose top speed is greater than 20 miles per hour, but not greater than 25 miles per hour.

medium truck
type: Class
subclass of: truck
definition: A truck which has a gross vehicle weight rating (GVWR) of more than 10,000 pounds and less than or equal to 26,000 pounds (4,536 to 11,793 kilograms).
adapted from: ANSI D.16-2017, section 2.2.25

modification or maintenance
type: Class
subclass of: process
subclass of: Restriction
  on property: part added
  min cardinality: 0
subclass of: Restriction
  on property: part removed
  min cardinality: 0
subclass of: Restriction
  on property: part replaced
  min cardinality: 0
subclass of: Restriction
  on property: carried out by
  on class: Class
    union of: business entity
    union of: business entity type
  min qualified cardinality: 0
subclass of: Restriction
  on property: airbag deployment
  min qualified cardinality: 0
  on data range: boolean
subclass of: Restriction
  on property: not-at-fault accident
  min qualified cardinality: 0
  on data range: boolean
subclass of: Restriction
  on property: original parts only
  min qualified cardinality: 0
  on data range: boolean
subclass of: Restriction
  on property: repaired
  min qualified cardinality: 0
  on data range: boolean
subclass of: Restriction
  on property: structural damage
  min qualified cardinality: 0
  on data range: boolean
comment: Typical examples are the replacement of the engine or the installation of a trailor-hitch.
definition: an event in which a part of the vehicle is being replaced or removed, or a new part is being added.

money-back guarantee
type: NamedIndividual
definition: The promise to take back the vehicle without any specific reason for a full refund within a certain amount of time

moped
type: Class
subclass of: motorcycle
definition: A speed-limited motor-driven cycle which may be propelled by pedaling.
adapted from: ANSI D.16-2017, section 2.2.9.4

motor-driven cycle
type: Class
subclass of: motorcycle
definition: Any motorcycle having an engine with less than 150 cubic centimeters displacement or with 5-brake horsepower or less.
adapted from: ANSI D.16-2017, section 2.2.9.1

motor boat
type: Class
subclass of: boat
definition: a boat which is powered by an engine

motor vehicle in-transport
type: Class
subclass of: role
comment: A motor vehicle that is In-transport state.
comment: See In-transport
definition: motor vehicle on a roadway or in motion within or outside the trafficway
adapted from: ANSI D.16-2017, section 2.2.34

motorcycle
type: Class
subclass of: motorized road vehicle
label: motocykl @pl
comment: QName: auto-vc-vc:Motorcycle
is part of: auto.schema.org
source: Automotive Ontology Working Group
direct source: Motorcycle
definition: Any motor vehicle having a seat or saddle for the use of its operator and designed to travel on not more than three wheels in contact with the ground.
definition: a single-track, two-wheeled motor vehicle
definition: pojazd samochodowy zaopatrzony w silnik spalinowy, dwukołowy lub z bocznym wózkiem – wielośladowy @pl
adapted from: ANSI D.16-2017, section 2.2.9
synonym: motorbike

motorized bicycle
type: Class
subclass of: motorized road vehicle
is part of: auto.schema.org
source: Automotive Ontology Working Group
direct source: MotorizedBicycle
definition: a bicycle with an attached motor used to power the vehicle, or to assist with pedaling

motorized road vehicle
type: Class
subclass of: road vehicle
subclass of: Restriction
  on property: acriss code
  min qualified cardinality: 0
  on data range: string
subclass of: Restriction
  on property: insurance group
  min qualified cardinality: 0
  on data range: string
subclass of: Restriction
  on property: insurance group 50
  min qualified cardinality: 0
  on data range: string
subclass of: Restriction
  on property: product code
  min qualified cardinality: 0
  on data range: string
comment: See 2.2.7.1, 2.2.7.2, 2.2.9 - 2.2.26
definition: Any motorized (mechanically or electrically powered) road vehicle not operated on rails.
definition: a wheeled land vehicle whose main propulsion is provided by an engine or motor
adapted from: ANSI D.16-2017, section 2.2.7

my car
type: Class
subclass of: role
label: mój samochód @pl
see also: source: https://www.toyota-ti.ac.jp/Lab/Denshi/COIN/Ontology/TTICore-0.03/TTICarOnto.owl
definition: vehicle that legally belongs to the subject

offering
type: Class
subclass of: generically dependent continuant
subclass of: Class
  intersection of: Restriction
    on property: short subtitle
    min qualified cardinality: 0
    on data range: PlainLiteral
  intersection of: Restriction
    on property: short subtitle
    max qualified cardinality: 1
    on data range: PlainLiteral
subclass of: Class
  intersection of: Restriction
    on property: short title
    min qualified cardinality: 0
    on data range: PlainLiteral
  intersection of: Restriction
    on property: short title
    max qualified cardinality: 1
    on data range: PlainLiteral
subclass of: Class
  intersection of: Restriction
    on property: subtitle
    min qualified cardinality: 0
    on data range: PlainLiteral
  intersection of: Restriction
    on property: subtitle
    max qualified cardinality: 1
    on data range: PlainLiteral
subclass of: Class
  intersection of: Restriction
    on property: terms and conditions
    min qualified cardinality: 0
    on data range: PlainLiteral
  intersection of: Restriction
    on property: terms and conditions
    max qualified cardinality: 1
    on data range: PlainLiteral
subclass of: Class
  intersection of: Restriction
    on property: offer promo code
    min qualified cardinality: 0
    on data range: string
  intersection of: Restriction
    on property: offer promo code
    max qualified cardinality: 1
    on data range: string
definition: thing offered especially as a gift or contribution

other bus
type: Class
subclass of: bus
definition: Any bus used for transportation purposes other than school bus, transit bus, intercity bus or charter bus.
adapted from: ANSI D.16-2017, section 2.2.10.6

ownership info
type: Class
subclass of: quality
subclass of: Restriction
  on property: mileage initial
  on class: qualitative value
  min qualified cardinality: 0
subclass of: Restriction
  on property: mileage end
  on class: quantitative value
  min qualified cardinality: 0
subclass of: Restriction
  on property: usage
  on class: car usage
  min qualified cardinality: 0
subclass of: Restriction
  on property: contains
  on class: ownership info
  min qualified cardinality: 0
subclass of: Restriction
  on property: parking
  on class: parking type
  min qualified cardinality: 0
subclass of: Restriction
  on property: pets
  on class: species
  min qualified cardinality: 0
subclass of: Restriction
  on property: main location
  on class: Class
    union of: location
    union of: postal address
  min qualified cardinality: 0
subclass of: Restriction
  on property: owner
  on class: Class
    union of: organization
    union of: person
  min qualified cardinality: 0
subclass of: Restriction
  on property: current owner
  on class: Class
    union of: organization
    union of: person
  min qualified cardinality: 0
subclass of: Restriction
  on property: smoking
  min qualified cardinality: 0
  on data range: boolean
subclass of: Restriction
  on property: from
  min qualified cardinality: 0
  on data range: dateTime
subclass of: Restriction
  on property: to
  min qualified cardinality: 0
  on data range: dateTime
subclass of: Restriction
  on property: number of drivers
  min qualified cardinality: 0
  on data range: integer
subclass of: Restriction
  on property: license plate
  min qualified cardinality: 0
  on data range: string
definition: a structured value representing information about the period of ownership of a vehicle by a person or organisation

paint choice or component
type: Class
subclass of: choice or component
definition: The class of paint choices or components (a "MonoSelectGroup" in automotive terminology), VW ID: 3

parked motor vehicle
type: Class
subclass of: role
definition: A motor vehicle not in- transport, other than a working motor vehicle, that is not in motion and not located on the roadway.
adapted from: ANSI D.16-2017, section 2.2.34.2

parking choice or component
type: Class
subclass of: choice or component
definition: The class of parking-related choices or components (a "MonoSelectGroup" in automotive terminology), VW ID: 7

parking type
type: Class
subclass of: qualitative value
comment: You can use DBpedia URIs for additional types.
definition: a type of parking for a vehicle, e.g. in a garage, on the street (open-sky), or in a carport

passenger car
type: Class
subclass of: regular vehicle
label: samochód osobowy @pl
see also: source: https://www.toyota-ti.ac.jp/Lab/Denshi/COIN/Ontology/TTICore-0.03/TTICarOnto.owl
definition: a road motor vehicle, other than a motor cycle, intended for the carriage of passengers and designed to seat no more than nine persons including the driver
definition: pojazd samochodowy przeznaczony konstrukcyjnie do przewozu nie więcej niż 9 osób łącznie z kierowcą oraz ich bagażu; @pl

passenger van
type: Class
subclass of: van
definition: Any van where the area behind the driver or cab is designated for carrying passengers.
adapted from: ANSI D.16-2017, section 2.2.14.1

payment method
type: Class
subclass of: qualitative value
definition: value indicating the payment method of a payment

pedalcycle
type: Class
subclass of: human powered land vehicle
definition: A non-motorized other road vehicle propelled by pedaling.

petrol
type: NamedIndividual
type: fuel type value
source: vso:FuelTypeValue
definition: Petrol, VW ID: 1
has ID: 1

pole trailer
type: Class
subclass of: trailer
definition: A trailer designed to be attached to the towing road vehicle by means of a reach or pole, or by being boomed or otherwise secured to the towing road vehicle, and ordinarily used for carrying property of a long or irregular shape such as poles, pipes or structural members that are generally capable of sustaining themselves as beams between the supporting connections.

price specification
type: Class
subclass of: value space
definition: indication of the unit price and delivery or payment charges

private
type: NamedIndividual
type: car usage
definition: The usage of a vehicle soleley for private purposes

property speciﬁcation
type: Class
subclass of: model
disjoint with: spec item collection
disjoint with: trim
definition: A Property Specification is an abstract entity specifying a set of properties for a vehicle that results from a single choice or the combination of two or more choices and that override the individual properties of the resulting vehicle. Example 1: Power steering and Air conditioning in combination reduce the available engine power from 90 kW to 89 kW. Example 2: Choosing the color option "blue" changes the color of the car to "blue".

pulpwood trailer
type: Class
subclass of: full trailer
definition: trailer or semitrailer that is designed exclusively for harvesting logs or pulpwood and constructed with a skeletal frame with no means for attachment of a solid bed, body, or container

quadracycle
type: Class
subclass of: pedalcycle
definition: a four-wheeled human-powered vehicle. It is also referred to as a quadricycle, quadcycle pedal car or four-wheeled bicycle

train
type: Class
subclass of: railway vehicle
definition: Any motorized railway vehicle.
adapted from: ANSI D.16-2017, section 2.2.5

railway vehicle
type: Class
subclass of: land vehicle
definition: Any land vehicle that is (1) designed primarily for, or in use for, moving persons or property from one place to another on rails and (2) not in use on a land way other than a railway.
adapted from: ANSI D.16-2017, section 2.2.4

rear-wheel drive
type: NamedIndividual
type: drive wheel configuration value
definition: Rear-wheel drive is a transmission layout where the engine drives the rear wheels.
synonym: RWD

regular vehicle
type: Class
subclass of: car
label: zwykły pojazd @pl
see also: source: https://www.toyota-ti.ac.jp/Lab/Denshi/COIN/Ontology/TTICore-0.03/TTICarOnto.owl
definition: normal vehicle used for daily commuting

relative price specification
type: Class
subclass of: price specification
definition: relative indication of the unit price and delivery or payment charges

rental vehicle usage
type: NamedIndividual
type: car usage
is part of: auto.schema.org
source: Automotive Ontology Working Group
definition: Indicates the usage of the vehicle as a rental car.

rickshaw
type: Class
subclass of: pedalcycle
definition: a two-wheeled cart which seats one or two persons and is being drawn by a runner
synonym: ricksha

right hand drive
type: NamedIndividual
type: steering position value
definition: The steering position is on the right side of the vehicle (viewed from the main direction of driving). For cars this means that you drive on the left side of the road.

road vehicle
type: Class
subclass of: land vehicle
comment: A superclass of classes addopted from ANSI D.16-2017.
definition: land vehicle other than a railway vehicle

roofs choice or component
type: Class
subclass of: choice or component
definition: The class of roof choices or components (a "MonoSelectGroup" in automotive terminology), VW ID: 5

sailing boat
type: Class
subclass of: boat
definition: a boat propelled partly or entirely by sails
synonym: sailboat

school bus
type: Class
subclass of: bus
comment: A motor vehicle is not a school bus while on trips which involve the transportation exclusively of other passengers or exclusively for other purposes. A motor vehicle is a school bus only if it is externally identifiable by the following characteristics : 1.) Its color is yellow, 2.) The words “ school bus '' appear on the front and rear, 3.) Flashing red lights are located on the front and rear, 4.) Lettering on both sides identifies the school or school district served, or the company operating the bus.
definition: A motor vehicle used for the transportation of any school pupil at or below the 12th-grade level to or from a public or private school or school-related activity.
adapted from: ANSI D.16-2017, section 2.8.1

seats choice or component
type: Class
subclass of: choice or component
definition: The class of seat-related choices or components (a "MonoSelectGroup" in automotive terminology), VW ID: 9

semitrailer
type: Class
subclass of: trailer
definition: A trailer, other than a pole trailer, designed for carrying property and so constructed that part of its weight rests upon or is carried by the towing road vehicle.
adapted from: ANSI D.16-2017, section 2.2.17

ship
type: Class
subclass of: watercraft
definition: a large watercraft that floats on water

single unit truck
type: Class
subclass of: truck
comment: When connected to a trailer, such a device may be part of a truck combination.
definition: A truck consisting primarily of a single motorized transport device designed for carrying property.
adapted from: ANSI D.16-2017, section 2.2.19

small bus
type: Class
subclass of: bus
definition: A bus with seating for nine to fifteen persons, including the driver.

small special vehicle
type: Class
subclass of: special vehicle
label: mały pojazd specjalny @pl
see also: source: https://www.toyota-ti.ac.jp/Lab/Denshi/COIN/Ontology/TTICore-0.03/TTICarOnto.owl
definition: special vehicle which is considered small

spec item collection
type: Class
subclass of: generically dependent continuant
subclass of: Class
  intersection of: Restriction
    on property: default
    on class: choice or component
    min qualified cardinality: 0
  intersection of: Restriction
    on property: default
    on class: choice or component
    max qualified cardinality: 1
subclass of: Class
  intersection of: Restriction
    on property: display position
    min qualified cardinality: 0
    on data range: int
  intersection of: Restriction
    on property: display position
    max qualified cardinality: 1
    on data range: int
subclass of: Class
  intersection of: Restriction
    on property: max
    min qualified cardinality: 0
    on data range: int
  intersection of: Restriction
    on property: max
    max qualified cardinality: 1
    on data range: int
subclass of: Class
  intersection of: Restriction
    on property: min
    min qualified cardinality: 0
    on data range: int
  intersection of: Restriction
    on property: min
    max qualified cardinality: 1
    on data range: int
subclass of: Restriction
  on property: available choice
  some values from: choice or component
disjoint with: trim
definition: A Spec Item Collection is an entity collating multiple coo:ChoiceOrComponent options for a given coo:Derivative, i.e. the available configurational choices. The default choice can be indicated using a coo:default link. All other choices are attached using coo:availableChoice. The number of coo:ChoiceOrComponent items that can / must be selected for a valid configuration are indicated via coo:min and coo:max.

special vehicle
type: Class
subclass of: car
label: pojazd specjalny @pl
see also: source: https://www.toyota-ti.ac.jp/Lab/Denshi/COIN/Ontology/TTICore-0.03/TTICarOnto.owl
definition: a vehicle or trailer intended to perform a special function requiring body adjustments or special equipment; this vehicle is capable of carrying persons and objects associated with the performance of this function
definition: pojazd samochodowy lub przyczepa przeznaczone do wykonywania specjalnej funkcji, która powoduje konieczność dostosowania nadwozia lub posiadania specjalnego wyposażenia; w pojeździe tym mogą być przewożone osoby i rzeczy związane z wykonywaniem tej funkcji @pl

species
type: Class
subclass of: qualitative value
comment: If possible, use DBPedia URIs, e.g. http://dbpedia.org/resource/Dog.
definition: typically a pet, for indicating the type of animals that were regularly transported in the vehicle

speed-limited motor-driven cycle
type: Class
subclass of: motorcycle
definition: Any motor- driven cycle which : 1.) will not attain a speed of more than 30 miles per hour (48 kilometers per hour) in one mile (1.609 kilometers) from a standing start, 2.) has an engine with not more than 50 cubic centimeters displacement or with 2-brake horsepower or less, and 3.) has a power drive system which does not require its operator to shift gears.
adapted from: ANSI D.16-2017, section 2.2.9.3

speed interval
type: Class
subclass of: quantitative value float
definition: a value indicating a speed interval, mostly for explaining acceleration data

steering position value
type: Class
subclass of: qualitative value
is part of: auto.schema.org
source: Automotive Ontology Working Group
direct source: SteeringPositionValue
definition: a value indicating a steering position

steering wheels choice or component
type: Class
subclass of: choice or component
definition: The class of steering wheels choices or components (a "MonoSelectGroup" in automotive terminology), VW ID: 6

straddle trailer
type: Class
subclass of: full trailer
definition: trailer that is designed to transport bulk agricultural commodities from the harvesting location, as evidenced by a framework that is driven over the cargo and lifting arms that suspend the cargo for transit

street
type: NamedIndividual
type: parking type
definition: The parking of a vehicle on a public or private street

4 speed auto
type: NamedIndividual
type: transmission type value automatic
source: vvo:TransmissionTypeValueAutomatic
definition: 4 Speed auto. VW ID: 1
gearbox type id: 1
has ID: 1

5 speed auto DSG
type: NamedIndividual
type: transmission type value automatic
source: vvo:TransmissionTypeValueAutomatic
definition: 5 Speed auto DSG, VW ID: 8
gearbox type id: 3
has ID: 8

5 speed auto tiptronic
type: NamedIndividual
type: transmission type value automatic
source: vvo:TransmissionTypeValueAutomatic
definition: 5 Speed auto tiptronic, VW ID: 3
gearbox type id: 2
has ID: 3

5 speed manual
type: NamedIndividual
type: transmission type value manual
source: vvo:TransmissionTypeValueManual
definition: 5 Speed manual, VW ID: 2
gearbox type id: 1
has ID: 2

6 speed auto
type: NamedIndividual
type: transmission type value automatic
source: vvo:TransmissionTypeValueAutomatic
definition: 6 Speed auto, VW ID: 5
gearbox type id: 2
has ID: 5

6 speed auto DSG
type: NamedIndividual
type: transmission type value automatic
source: vvo:TransmissionTypeValueAutomatic
definition: 6 Speed auto DSG, VW ID: 6
gearbox type id: 3
has ID: 6

6 speed auto tiptronic
type: NamedIndividual
type: transmission type value automatic
source: vvo:TransmissionTypeValueAutomatic
definition: 6 Speed auto tiptronic, VW ID: 7
gearbox type id: 2
has ID: 7

6 speed manual
type: NamedIndividual
type: transmission type value manual
source: vvo:TransmissionTypeValueManual
definition: 6 Speed manual, VW ID: 4
gearbox type id: 1
has ID: 4

7 speed auto DSG
type: NamedIndividual
type: transmission type value automatic
source: vvo:TransmissionTypeValueAutomatic
definition: 7 Speed auto DSG, VW ID: 9
gearbox type id: 3
has ID: 9

8 speed auto
type: NamedIndividual
type: transmission type value automatic
source: vvo:TransmissionTypeValueAutomatic
definition: 8 Speed auto, VW ID: 10
gearbox type id: 2
has ID: 10

unspecified
type: NamedIndividual
type: transmission type value
source: vso:TransmissionTypeValue
definition: Unspecified, VW ID: 0
gearbox type id: 1
has ID: 0

taxi vehicle usage
type: NamedIndividual
type: car usage
is part of: auto.schema.org
source: Automotive Ontology Working Group
definition: Indicates the usage of the car as a taxi.

three-wheeled motorcycle
type: Class
subclass of: motorcycle
definition: Any motor vehicle having a seat or saddle for the use of its operator, and having three wheels in contact with the ground.
adapted from: ANSI D.16-2017, section 2.2.9.6

tractor pole trailer
type: Class
subclass of: pole trailer
definition: combination vehicle that carries logs lengthwise so that they form the body of the vehicle

traffic pattern value
type: Class
subclass of: qualitative value
definition: A value indicating a traffic pattern, to be used as a reference for vso:fuelConsumption or vso:fuelEconomy

trailer
type: Class
subclass of: road vehicle
definition: A road vehicle designed to be drawn by another road vehicle.
adapted from: ANSI D.16-2017, section 2.2.15

transit bus
type: Class
subclass of: bus
definition: A bus used for passenger transportation over fixed, scheduled routes within primarily urban geographical areas.
adapted from: ANSI D.16-2017, section 2.2.10.3

transmission type value
type: Class
subclass of: qualitative value
subclass of: Class
  intersection of: Restriction
    on property: gearbox type id
    min qualified cardinality: 0
    on data range: string
  intersection of: Restriction
    on property: gearbox type id
    max qualified cardinality: 1
    on data range: string
comment: You can safely use any reasonable DBPedia URI, e.g. http://dbpedia.org/resource/Manual_transmission http://dbpedia.org/resource/Automatic_transmission
definition: a value indicating a type of transmission

transmission type value automatic
type: Class
subclass of: transmission type value
definition: The class of all automatic transmission types

transmission type value manual
type: Class
subclass of: transmission type value
definition: The class of all manual transmission types

transport vehicle
type: Class
subclass of: special vehicle
comment: Such devices or animals shall include at least one of the following : 1.) A transport device, or a unit, made up of connected transport devices, while idle or in use, for moving persons or property from one place to another, 2.) An animal or team of animals while in use for moving person or property other than the animal or team itself from one place to another, or 3.) A movable device such as construction, farm or industrial machinery outside the confines of a building and its premises while in use for moving persons, the device itself, or other property from one place to another.
definition: Consists of one or more devices or animals and their load.
adapted from: ANSI D.16-2017, section 2.1.4

trim
type: Class
subclass of: model
subclass of: Restriction
  on property: has derivative
  on class: derivative
  min qualified cardinality: 0
definition: A Trim is an abstract entity specifying (1) the basic features plus (2) a set of configuration choices (mostly non-functional) of a group of vehicles. A Trim should be linked to its Base Model via gr:isVariantOf, if available. Examples: VW Golf S, VW Polo Match, VW Passat SE

truck
type: Class
subclass of: large special vehicle
subclass of: transport vehicle
label: samochód ciężarowy @pl
comment: QName: auto-vc-vc:Truck
comment: pojazd samochodowy przeznaczony konstrukcyjnie do przewozu ładunków @pl
definition: A motor vehicle designed primarily for carrying property.
definition: a motor vehicle designed to transport cargo
adapted from: ANSI D.16-2017, section 2.2.13
synonym: lorry

truck combination
type: Class
subclass of: truck
definition: A truck consisting primarily of a transport device which is a single- unit truck or truck tractor together with one or more attached trailers.
adapted from: ANSI D.16-2017, section 2.2.21

truck tractor
type: Class
subclass of: truck
definition: A motor vehicle consisting of a single motorized transport device designed primarily for drawing trailers.
adapted from: ANSI D.16-2017, section 2.2.20

two-stroke mixture
type: NamedIndividual
type: fuel type value
definition: A pre-mixed fuel-oil mixture

upholstery choice or component
type: Class
subclass of: choice or component
definition: The class of upholstery choices or components (a "MonoSelectGroup" in automotive terminology), VW ID: 4

urban
type: NamedIndividual
type: traffic pattern value
source: vvo:TrafficPattern
definition: Urban usage as a traffic pattern

utility vehicle
type: Class
subclass of: special vehicle
comment: These vehicles are generally four wheel-drive (4 x 4) and have increased ground clearance. A utility vehicle typically has a gross vehicle weight rating (GVWR) of 10,000 pounds or less. Utility vehicles with wheelbases greater than 88 inches are classified by overall width. The wheelbase and overall width should be rounded to the nearest inch.
definition: A motor vehicle other than a motorcycle or large bus consisting primarily of a transport device designed for carrying persons, and generally considered a multi-purpose vehicle that is designed to have off-road capabilities.

van
type: Class
subclass of: small special vehicle
comment: Vans are classified by size based on frame type and overall vehicle body width. Before classification, vehicle width should be rounded to the nearest inch.
definition: A gross vehicle weight rating (GVWR) of 10,000 pounds or less and is basically a “ box on wheels ” that is identifiable by its enclosed passenger and/or cargo area, step-up floor, and relatively short (or nonexistent) hood.
definition: a kind of vehicle used for transporting goods or groups of people. It is usually a box-shaped vehicle on four wheels, about the same width and length as a large automobile, but taller and usually higher off the ground, also referred to as a light commercial vehicle or LCV.
adapted from: ANSI D.16-2017, section 2.2.14

van-based bus
type: Class
subclass of: van
definition: Any passenger van designed for carrying nine or more persons, including the driver.
adapted from: ANSI D.16-2017, section 2.2.14.4

van-based motorhome
type: Class
subclass of: van
definition: Any van where a frame-mounted recreational unit is added behind the driver or cab area.
adapted from: ANSI D.16-2017, section 2.2.14.3

vehicle
type: Class
subclass of: object
subclass of: Restriction
  on property: condition
  min cardinality: 0
subclass of: Restriction
  on property: known vehicle damages
  min cardinality: 0
subclass of: Restriction
  on property: cargo volume
  on class: quantitative value
  min qualified cardinality: 0
subclass of: Restriction
  on property: acceleration time
  on class: quantitative value float
  min qualified cardinality: 0
subclass of: Restriction
  on property: usage
  on class: car usage
  min qualified cardinality: 0
subclass of: Restriction
  on property: has ownership info
  on class: ownership info
  min qualified cardinality: 0
subclass of: Restriction
  on property: parking
  on class: parking type
  min qualified cardinality: 0
subclass of: Restriction
  on property: list price
  on class: price specification
  min qualified cardinality: 0
subclass of: Restriction
  on property: valuation
  on class: price specification
  min qualified cardinality: 0
subclass of: Restriction
  on property: pets
  on class: species
  min qualified cardinality: 0
subclass of: Restriction
  on property: current location
  on class: Class
    union of: location
    union of: postal address
  min qualified cardinality: 0
subclass of: Restriction
  on property: owner
  on class: Class
    union of: organization
    union of: person
  min qualified cardinality: 0
subclass of: Restriction
  on property: current owner
  on class: Class
    union of: organization
    union of: person
  min qualified cardinality: 0
subclass of: Restriction
  on property: short subtitle
  min qualified cardinality: 0
  on data range: PlainLiteral
subclass of: Restriction
  on property: short title
  min qualified cardinality: 0
  on data range: PlainLiteral
subclass of: Restriction
  on property: subtitle
  min qualified cardinality: 0
  on data range: PlainLiteral
subclass of: Restriction
  on property: terms and conditions
  min qualified cardinality: 0
  on data range: PlainLiteral
subclass of: Restriction
  on property: indication of odometer rollback
  min qualified cardinality: 0
  on data range: boolean
subclass of: Restriction
  on property: rental usage
  min qualified cardinality: 0
  on data range: boolean
subclass of: Restriction
  on property: repaired
  min qualified cardinality: 0
  on data range: boolean
subclass of: Restriction
  on property: smoking
  min qualified cardinality: 0
  on data range: boolean
subclass of: Restriction
  on property: structural damage
  min qualified cardinality: 0
  on data range: boolean
subclass of: Restriction
  on property: purchase date
  min qualified cardinality: 0
  on data range: dateTime
subclass of: Restriction
  on property: vehicle model date
  min qualified cardinality: 0
  on data range: dateTime
subclass of: Restriction
  on property: number of drivers
  min qualified cardinality: 0
  on data range: integer
subclass of: Restriction
  on property: number of owners
  min qualified cardinality: 0
  on data range: integer
subclass of: Restriction
  on property: known vehicle damages
  min qualified cardinality: 0
  on data range: string
subclass of: Restriction
  on property: airbag deployment
  on data range: boolean
  qualified cardinality: 1
subclass of: Restriction
  on property: marketing name
  some values from: string
label: pojazd @pl
is part of: auto.schema.org
source: Automotive Ontology Working Group
direct source: Vehicle
definition: a device that is designed or used to transport people or cargo over land, water, air, or through space

warranty scope
type: Class
subclass of: generically dependent continuant
definition: period of time during which the warranty is valid

watercraft
type: Class
subclass of: vehicle
definition: A transport vehicle designed primarily for, or in use for, moving persons or property on or through, and supported by, water from one place to another.
definition: a vehicle, vessel or craft designed to move across or through water
adapted from: ANSI D.16-2017, section 2.1.6

wheels choice or component
type: Class
subclass of: choice or component
definition: The class of wheels-related choices or components (a "MonoSelectGroup" in automotive terminology), VW ID: 2

working motor vehicle
type: Class
subclass of: role
comment: This "work" may be located within open or closed portions of the trafficway and motor vehicles performing these activities can be within or outside of the trafficway boundaries.
definition: A motor vehicle in the act of performing construction, maintenance or utility work related to the trafficway.
adapted from: ANSI D.16-2017, section 2.2.7.2.

acceleration time
type: ObjectProperty
is part of: auto.schema.org
source: Automotive Ontology Working Group
domain: vehicle
range: quantitative value float
definition: The time needed to accelerate the vehicle from a given start velocity to a given target velocity. Typical unit code(s): SEC for seconds Note: There are unfortunately no standard unit codes for seconds/0..100 km/h or seconds/0..60 mph. Simply use "SEC" for seconds and indicate the velocities in the name of the QuantitativeValue, or use valueReference with a QuantitativeValue of 0..60 mph or 0..100 km/h to specify the reference speeds.

acriss code
type: DatatypeProperty
is part of: auto.schema.org
source: Automotive Ontology Working Group
domain: motorized road vehicle
domain: Class
  union of: bus
  union of: car
range: string
definition: The ACRISS Car Classification Code is a code used by many car rental companies, for classifying vehicles. ACRISS stands for Association of Car Rental Industry Systems and Standards.

advanced payment
type: ObjectProperty
domain: financing
range: price specification
definition: Indicates the advanced payment for the financing

airbag deployment
type: DatatypeProperty
domain: Class
  union of: damage or accident
  union of: vehicle
range: boolean
definition: This property indicates whether at least one of the airbags of the vehicle has been deployed in the respective accident (when attached to uco:DamageOrAccident) or ever (when directly applied to a vso:Vehicle).

apr
type: DatatypeProperty
domain: financing
range: decimal
definition: Annual percentage rate. Note: 7.5 % is encoded as "7.5"^^xsd:decimal, not "0.075"^^xsd:decimal.

available choice
type: ObjectProperty
domain: spec item collection
range: choice or component
definition: This property links available Choices or Components to a Spec Item.

body style
type: ObjectProperty
sub property of: topObjectProperty
is part of: auto.schema.org
source: Automotive Ontology Working Group
range: body style value
definition: Indicates the design and body style of the vehicle (e.g. station wagon, hatchback, etc.).
definition: Indicates the design and body style of the vehicle. Use DBPedia resources to indicate the features, if possible. Popular identifiers are http://dbpedia.org/resource/Convertible http://dbpedia.org/resource/Hatchback http://dbpedia.org/resource/Station_wagon http://dbpedia.org/resource/Sport_utility_vehicle http://dbpedia.org/resource/Roadster See also http://en.wikipedia.org/wiki/Car_body_styles. If you cannot find a suitable identifier in DBPedia, define your own as an instance of vso:BodyStyleValue.
synonym: body type

cap code
type: DatatypeProperty
domain: derivative
range: string
definition: The CAP code

cargo volume
type: ObjectProperty
is part of: auto.schema.org
source: Automotive Ontology Working Group
domain: vehicle
range: quantitative value float
definition: The available volume for cargo or luggage. For automobiles, this is usually the trunk volume. Typical unit code(s): LTR for liters, FTQ for cubic foot/feet Note: You can use minValue and maxValue to indicate ranges.

carried out by
type: ObjectProperty
domain: Class
  union of: check
  union of: damage or accident
  union of: modification or maintenance
range: Class
  union of: business entity
  union of: business entity type
definition: The business or type of business that carried out the check, repair, maintenance, or modification

color
type: DatatypeProperty
sub property of: topDataProperty
domain: vehicle
range: Literal
definition: The color of the vehicle

compatibility
type: ObjectProperty
domain: derivative
range: configuration info
definition: Links from a Derivative to information on whether a particular configuration is valid (true) or invalid (false)

compatible with
type: ObjectProperty
type: SymmetricProperty
domain: choice or component
range: choice or component
definition: Indicates that two Choices or Components are compatible with each other. Note: This property is symmetric, i.e., if A is compatible with B, then B is also compatible with A.

condition
type: DatatypeProperty
domain: vehicle
range: Literal
definition: A textual description of the condition of the vehicle. This property should be mainly used with gr:ActualProductOrServiceInstance.

contains
type: ObjectProperty
domain: ownership info
range: ownership info
definition: A naive part-whole relation that allows providing more granular uco:OwnershipInfo data for a part of the duration of the ownership

country of origin
type: DatatypeProperty
domain: vehicle
range: string
definition: The country or geo-political region in which the vehicle was initially sold officially, indicated as the two-character version of ISO 3166-1 (ISO 3166-1 alpha-2) for regions or ISO 3166-2, which breaks down the countries from ISO 3166-1 into administrative subdivisions.

country of registration
type: DatatypeProperty
domain: vehicle
range: string
definition: The country or geo-political region in which the vehicle is currently registered, indicated as the two-character version of ISO 3166-1 (ISO 3166-1 alpha-2) for regions or ISO 3166-2, which breaks down the countries from ISO 3166-1 into administrative subdivisions.

credit
type: ObjectProperty
domain: financing
range: price specification
definition: Indicates the credit for the financing

current location
type: ObjectProperty
domain: vehicle
range: location
range: postal address
definition: The current location of the vehicle, i.e. where the car could be tested. For indicating alternative locations to which the seller is willing to bring the car, use gr:availableAtOrFrom attached to the gr:Offering, since those are aspects of the offer, not of the vehicle.

current owner
type: ObjectProperty
sub property of: owner
definition: This property points to the current owner of the vehicle.

customer cash price
type: ObjectProperty
domain: financing
range: price specification
definition: Indicates the customer cash price for the financing

customer deposit
type: ObjectProperty
domain: financing
range: price specification
definition: Indicates the customer deposit for the financing

cylinder type id
type: DatatypeProperty
range: string
definition: The Volkswagen-specific identifier for the cylinder type of a vehicle or engine

date launched
type: DatatypeProperty
sub property of: topDataProperty
domain: vehicle
range: dateTime
definition: The date of the official launch of the car model

date vehicle first registered
type: DatatypeProperty
sub property of: topDataProperty
is part of: auto.schema.org
source: Automotive Ontology Working Group
domain: vehicle
range: dateTime
definition: The date of the first registration of the vehicle with the respective public authorities.
definition: The date of the first registration of the vehicle with the respective public authorities. This property should be used mainly with gr:ActualProductOrServiceInstance.

default
type: ObjectProperty
sub property of: available choice
definition: This property links the default Choice or Component to a Spec Item. Since it is defined a sub-property of coo:availableChoice, the default choice is automatically part of the available choices.

depends on
type: ObjectProperty
domain: choice or component
range: choice or component
definition: Links a Choice or Component to one or multiple other Choices Or Components required for that choice Note: This property is transitive, i.e., if B is required by A and C and D are required by B, then C and D are also required by A.

deposit contribution
type: ObjectProperty
domain: financing
range: price specification
definition: Indicates the deposit contribution for the financing

dh code
type: DatatypeProperty
domain: derivative
range: string
definition: The DH code

discount
type: ObjectProperty
domain: financing
range: price specification
definition: Indicates the discount for the financing

display position
type: DatatypeProperty
range: int
definition: The position at which the option or element should be listed in a menu or user dialog, lower numbers come first. The main usage of this property are coo:SpecItemCollection and coo:ChoiceOrComponent, but it is possible to apply it to any owl:Class. Note: It is recommended to rely on this property only for data originating from a single RDF graph; otherwise, unpredictable results are possible.

drive wheel configuration
type: ObjectProperty
sub property of: topObjectProperty
is part of: auto.schema.org
source: Automotive Ontology Working Group
domain: vehicle
range: drive wheel configuration value
definition: The drive wheel configuration, i.e. which roadwheels will receive torque from the vehicle's engine via the drivetrain
definition: The drive wheel configuration, i.e. which roadwheels will receive torque from the vehicle's engine via the drivetrain.

driver
type: ObjectProperty
domain: vehicle
range: person
definition: This property points to the driver or drivers that were regularly driving the vehicle during the respective period of time (when attached to uco:OwnershipInfo) or in total (when attached directly to a vso:Vehicle).

emissions CO2
type: DatatypeProperty
is part of: auto.schema.org
source: Automotive Ontology Working Group
range: float
definition: The CO2 emissions in g/km. When used in combination with a QuantitativeValue, put "g/km" into the unitText property of that value, since there is no UN/CEFACT Common Code for "g/km".

emissions per passenger
type: DatatypeProperty
domain: vehicle
range: Literal
definition: relates a vehicle to the amount of emissions it emits per passenger present in it during driving

engine displacement
type: ObjectProperty
is part of: auto.schema.org
source: Automotive Ontology Working Group
domain: engine specification
range: quantitative value float
definition: The volume swept by all of the pistons inside the cylinders of an internal combustion engine in a single movement. Typical unit code(s): CMQ for cubic centimeter, LTR for liters, INQ for cubic inches * Note 1: You can link to information about how the given value has been determined using the valueReference property. * Note 2: You can use minValue and maxValue to indicate ranges.

engine name
type: DatatypeProperty
sub property of: topDataProperty
domain: object
range: Literal
definition: A short text indicating the engine(s) of the vehicle

engine power
type: ObjectProperty
is part of: auto.schema.org
source: Automotive Ontology Working Group
domain: engine specification
range: quantitative value float
definition: The power of the vehicle's engine. Typical unit code(s): KWT for kilowatt, BHP for brake horsepower, N12 for metric horsepower (PS, with 1 PS = 735,49875 W) Note 1: There are many different ways of measuring an engine's power. For an overview, see http://en.wikipedia.org/wiki/Horsepower#Enginepowertest_codes. Note 2: You can link to information about how the given value has been determined using the valueReference property. Note 3: You can use minValue and maxValue to indicate ranges.

engine type
type: ObjectProperty
sub property of: topObjectProperty
is part of: auto.schema.org
source: Automotive Ontology Working Group
domain: engine specification
range: engine type value
definition: The type of engine or engines powering the vehicle.
definition: The type of engine or engines powering the vehicle. If there are multiple engines, simply attach this property multiple times. Use DBPedia resources to indicate the engine type. Popular identifiers are http://dbpedia.org/resource/Two-stroke_engine http://dbpedia.org/resource/Four-stroke_engine http://dbpedia.org/resource/Wankel_engine http://dbpedia.org/resource/Electric_motor If you cannot find a suitable identifier in DBPedia, define your own as an instance of vso:EngineTypeValue.

event information
type: ObjectProperty
domain: vehicle
definition: This property points to events related to the vehicle, like accidents and damages or major modifications or maintenance.

excess mileage
type: ObjectProperty
domain: financing
range: price specification
definition: Indicates the rate for excess mileage

feature
type: ObjectProperty
sub property of: topObjectProperty
domain: vehicle
range: property value
definition: Indicates a built-in feature, accessory, or component of the vehicle. Use DBPedia resources to indicate the features, if possible. Popular identifiers are http://dbpedia.org/resource/Anti-lock_braking_system http://dbpedia.org/resource/Electronic_stability_control http://dbpedia.org/resource/Armrest http://dbpedia.org/resource/Spoiler_%28automotive%29 http://dbpedia.org/resource/CD_Changer http://dbpedia.org/resource/Cup_holder http://dbpedia.org/resource/Tow_hitch http://dbpedia.org/resource/Power_window http://dbpedia.org/resource/Power_steering http://dbpedia.org/resource/Air_conditioner http://dbpedia.org/resource/Child_safety_lock http://dbpedia.org/resource/Parking_sensors See also http://en.wikipedia.org/wiki/Category:Automotive_accessories. If you cannot find a suitable identifier in DBPedia, define your own as an instance of vso:FeatureValue.
definition: This property points to vehicle features in a semi-structured property-value form.

feature override
type: ObjectProperty
domain: Class
  union of: choice or component
  union of: configuration info
range: property speciﬁcation
definition: Links a coo:ConfigurationInfo node to information on how a choice or component or the combination of multiple choices will override the regular properties of the resulting vehicle

final payment
type: DatatypeProperty
domain: financing
range: decimal
definition: Indicates the final payment for the financing

final payment fee
type: ObjectProperty
domain: financing
range: price specification
definition: Indicates the final payment fee for the financing

first monthly payment fee
type: ObjectProperty
domain: financing
range: price specification
definition: Indicates the first monthly payment fee for the financing

from
type: DatatypeProperty
domain: ownership info
range: dateTime
definition: This property indicates the beginning of the period of ownership represented by this uco:OwnershipInfo node.

fuel capacity
type: ObjectProperty
is part of: auto.schema.org
source: Automotive Ontology Working Group
domain: vehicle
range: quantitative value float
definition: The capacity of the fuel tank or in the case of electric cars, the battery. If there are multiple components for storage, this should indicate the total of all storage of the same type. Typical unit code(s): LTR for liters, GLL of US gallons, GLI for UK / imperial gallons, AMH for ampere-hours (for electrical vehicles).

fuel consumption
type: ObjectProperty
is part of: auto.schema.org
source: Automotive Ontology Working Group
domain: vehicle
range: quantitative value float
definition: The amount of fuel consumed for traveling a particular distance or temporal duration with the given vehicle (e.g. liters per 100 km). Note 1: There are unfortunately no standard unit codes for liters per 100 km. Use unitText to indicate the unit of measurement, e.g. L/100 km. Note 2: There are two ways of indicating the fuel consumption, fuelConsumption (e.g. 8 liters per 100 km) and fuelEfficiency (e.g. 30 miles per gallon). They are reciprocal. Note 3: Often, the absolute value is useful only when related to driving speed ("at 80 km/h") or usage pattern ("city traffic"). You can use valueReference to link the value for the fuel consumption to another value.
definition: The distance traveled per unit of fuel used; most commonly miles per gallon (mpg) or kilometers per liter (km/L). Note 1: There are unfortunately no standard unit codes for miles per gallon or kilometers per liter. Use unitText to indicate the unit of measurement, e.g. mpg or km/L. Note 2: There are two ways of indicating the fuel consumption, fuelConsumption (e.g. 8 liters per 100 km) and fuelEfficiency (e.g. 30 miles per gallon). They are reciprocal. Note 3: Often, the absolute value is useful only when related to driving speed ("at 80 km/h") or usage pattern ("city traffic"). You can use valueReference to link the value for the fuel economy to another value.
synonym: fuel efficiency

fuel injection type id
type: DatatypeProperty
range: string
definition: The Volkswagen-specific identifier for the fuel injection type of a vehicle or engine

fuel type
type: ObjectProperty
sub property of: topObjectProperty
is part of: auto.schema.org
source: Automotive Ontology Working Group
domain: vehicle
range: fuel type value
definition: The type of fuel suitable for the engine or engines of the vehicle. Use DBPedia resources to indicate the fuel type. Popular identifiers are http://dbpedia.org/resource/Gasoline http://dbpedia.org/resource/Diesel http://dbpedia.org/resource/Biodiesel http://dbpedia.org/resource/Kerosene For two-stroke mixtures, use vso:TwoStrokeMixture.
definition: The type of fuel suitable for the engine or engines of the vehicle. If the vehicle has only one engine, this property can be attached directly to the vehicle.

gearbox
type: ObjectProperty
sub property of: topObjectProperty
domain: vehicle
range: gearbox type value
definition: The gearbox type of the vehicle or vehicle model

gearbox type id
type: DatatypeProperty
range: string
definition: The Volkswagen-specific gearbox type ID

has complete car model
type: ObjectProperty
domain: derivative
range: complete car model
definition: Links one or multiple Complete Car Models to the underlying Derivative

has derivative
type: ObjectProperty
domain: trim
range: derivative
definition: Links a Derivative to a Trim

has electric energy consumtion
type: DatatypeProperty
range: Literal
definition: This property represents the electric energy consumption of a vehicle measured in Wh/km.

has emissions reduction
type: DatatypeProperty
range: Literal
definition: This property represents emissions reduction measured in g/km that a vehicle has, through the implemented innovative technologies.

has engine capacity
type: DatatypeProperty
range: Literal
definition: This property shows the capacity of the engine of a vehicle measured in cm3

has fuel mode
type: DatatypeProperty
range: Literal
definition: This property represents the fuel mode of a vehicle

has ID
type: DatatypeProperty
range: string
definition: An annotation property that can be used to attach element identifiers from XML schemas for the corresponding XML data or schema
definition: An annotation property that can be used to attach element identifiers from XML schemas for the corresponding XML data or schema.

has innovative technology
type: DatatypeProperty
range: Literal
definition: This property represents an innovation technology that a vehicle has implemented.

has MSReg manufacturer name
type: DatatypeProperty
range: Literal
definition: This property represents a manufacturer name as in the registry of Member States of the European Environment Agency.

has manufacturer harmonised name
type: DatatypeProperty
range: Literal
definition: This property represents a manufacturer harmonised name.

has manufacturer pooling
type: DatatypeProperty
range: Literal
definition: This property represents a manufacturers pooling.

has other axle width
type: DatatypeProperty
domain: vehicle
range: Literal
definition: This property represents the width of the other steering axle of a vehicle measured in mm.

has ownership info
type: ObjectProperty
domain: vehicle
range: ownership info
definition: This property points to information about the current and previous owners of the vehicle.

has spec item choice
type: ObjectProperty
domain: complete car model
range: choice or component
definition: Links a Complete Car Model to the choices for configurational options

has spec items
type: ObjectProperty
domain: derivative
range: spec item collection
definition: This property links available Spec Items to a Derivative.

has steering axle width
type: DatatypeProperty
domain: vehicle
range: Literal
definition: This property represents the width of the steering axle of a vehicle measured in mm.

has total new registrations
type: DatatypeProperty
domain: vehicle
range: int
definition: This property represents the nubmer of total new registration of a vehicle.

has trim
type: ObjectProperty
domain: base model
range: trim
definition: Links a Trim to Base Model

has type approval number
type: DatatypeProperty
range: Literal
definition: This property represents an internal type approval number.

height
type: ObjectProperty
domain: vehicle
range: quantitative value float
definition: The outer height of the vehicle. Note that you can use gr:hasMinValueFloat and gr:hasMaxValueFloat to indicate ranges. Typical unit code(s): CMT for centimeters, MTR for meters, INH for inches, FOT for foot/feet

height open tailgate
type: ObjectProperty
domain: vehicle
range: quantitative value
definition: The outer height of the vehicle with the tailgate open. Note that you can use gr:hasMinValueFloat and gr:hasMaxValueFloat to indicate ranges. Typical unit code(s): CMT for centimeters, MTR for meters, INH for inches, FOT for foot/feet
synonym: height open bonnet

includes
type: ObjectProperty
domain: choice or component
range: choice or component
definition: Links a Choice or Component to one or multiple other Choices Or Components implicity contained Note: This property is transitive, i.e., if B is included in A and C and D are included in B, then C and D are also included in A.

includes choices
type: ObjectProperty
domain: configuration info
range: choice or component
definition: Indicates the set of Choices Or Components to which the Configuration Info node refers Note 1: Complementing compatibility information can be attached to the components directly via coo:compatibleWith, coo:incompatibleWith, coo:dependsOn, and coo:includes. Note 2: The coo:ConfigurationInfo node makes only a valid statement for a configuration that includes ALL of the Choices or Components attached via this property. Note 3: If you want to know whether further components can be added, check that there are no coo:incompatibleWith relationships with any Choice or Component. This check must also be extended to all Choices or Components implicitly included via coo:includes. Note 4: If you want to know whether some components may be omitted without invalidating the configuration, check that there are no coo:dependsOn relationships with any Choice or Component. This check must also be extended to all Choices Or Components implicitly included via coo:includes. Note 5: Under an Open World Assumption (OWA), only an explicit compatibility statement for your configuration is really reliable. A weaker guarantee may be sufficient for your application, though.

incompatible with
type: ObjectProperty
type: SymmetricProperty
domain: choice or component
range: choice or component
definition: Indicates that two Choices or Components are incompatible with each other, independent from other choices. Note: This property is symmetric, i.e., if A is incompatible with B, then B is also incompatible with A.

indication of odometer rollback
type: DatatypeProperty
domain: vehicle
range: boolean
definition: This property indicates whether it is likely or known that the odometer of the vehicle does not properly reflect the total mileage of the vehicle, e.g. because the odometer has been replaced, reset, or tampered with

inspected
type: ObjectProperty
domain: vehicle
definition: This property points to inspections and certifications that the vehicle has undergone.

insurance group
type: DatatypeProperty
domain: motorized road vehicle
range: string
definition: The insurance group code

insurance group 50
type: DatatypeProperty
domain: motorized road vehicle
range: string
definition: The insurance group 50 code

known vehicle damages
type: DatatypeProperty
is part of: auto.schema.org
source: Automotive Ontology Working Group
domain: vehicle
range: string
definition: A textual description of known damages, both repaired and unrepaired.
definition: A textual description of known damages, both repaired and unrepaired. Note: This property should be used with gr:ActualProductOrServiceInstance (when offering a vehicle) or gr:ProductOrServicesSomeInstancesPlaceholder (when seeking a vehicle using gr:seeks) only.

length
type: ObjectProperty
domain: vehicle
range: quantitative value float
definition: The outer length of the vehicle. Note that you can use gr:hasMinValueFloat and gr:hasMaxValueFloat to indicate ranges. Typical unit code(s): CMT for centimeters, MTR for meters, INH for inches, FOT for foot/feet

license plate
type: DatatypeProperty
domain: ownership info
range: string
definition: The license plate string(s) assigned to the vehicle during the period of ownership

list price
type: ObjectProperty
domain: vehicle
range: price specification
definition: The original list price of the new car at the time of production

luggage capacity seats folded
type: ObjectProperty
sub property of: cargo volume
definition: The available volume for cargo or luggage with the seats folded Typical unit code(s): LTR for liters, FTQ for cubic foot/feet Note: You can use gr:hasMinValueFloat and gr:hasMaxValueFloat to indicate ranges.

luggage capacity seats upright
type: ObjectProperty
sub property of: cargo volume
definition: The available volume for cargo or luggage with the seats upright Typical unit code(s): LTR for liters, FTQ for cubic foot/feet Note: You can use gr:hasMinValueFloat and gr:hasMaxValueFloat to indicate ranges.

main location
type: ObjectProperty
domain: ownership info
range: location
range: postal address
definition: The main location(s) of the vehicle during the period of ownership

manufacturer code
type: DatatypeProperty
domain: vehicle
range: string
definition: The manufacturer code

marketing name
type: DatatypeProperty
range: string
definition: The name of the object for marketing purposes

max
type: DatatypeProperty
domain: spec item collection
range: int
definition: The maximum number of coo:ChoiceOrComponent entities that can be selected for a valid configuration

meets emission standard
type: ObjectProperty
sub property of: topObjectProperty
is part of: auto.schema.org
source: Automotive Ontology Working Group
domain: vehicle
range: emission standard value
definition: Indicates that the vehicle meets the respective emission standard.
definition: Indicates that the vehicle meets the respective emission standard. Use DBPedia resources to indicate the standard, if possible. Popular identifiers are http://dbpedia.org/resource/Super_Ultra_Low_Emission_Vehicle http://dbpedia.org/resource/Partial_zero-emissions_vehicle See also http://en.wikipedia.org/wiki/Emissions_standard. Unfortunately, there are no DBPedia identifiers for the popular Euro 1 - Euro 5 standards available. If you cannot find a suitable identifier in DBPedia, define your own as an instance of vso:EmissionStandardValue.

mileage
type: ObjectProperty
range: quantitative value
definition: The mileage of the vehicle at the event, e.g. at the accident, maintenance, check, or modification. Typical unit code(s): KMT for kilometers, SMI for statute miles

mileage end
type: ObjectProperty
domain: ownership info
range: quantitative value
definition: The mileage of the vehicle at the end of the period of ownership. Typical unit code(s): KMT for kilometers, SMI for statute miles

mileage from odometer
type: ObjectProperty
is part of: auto.schema.org
source: Automotive Ontology Working Group
domain: vehicle
range: quantitative value float
definition: The total distance travelled by the particular vehicle since its initial production, as read from its odometer. Typical unit code(s): KMT for kilometers, SMI for statute miles

mileage initial
type: ObjectProperty
domain: ownership info
range: quantitative value
definition: The mileage of the vehicle at the beginning of the period of ownership. Typical unit code(s): KMT for kilometers, SMI for statute miles

min
type: DatatypeProperty
domain: spec item collection
range: int
definition: The minimum number of coo:ChoiceOrComponent entities that must be selected for a valid configuration

monthly payment
type: ObjectProperty
domain: financing
range: price specification
definition: Indicates the monthly payment for the financing

number of monthly payments
type: DatatypeProperty
domain: financing
range: decimal
definition: The number of monthly payments

not-at-fault accident
type: DatatypeProperty
domain: damage or accident
range: boolean
definition: This property indicates whether the accident leading to the damage was a not-at-fault accident from the perspective of the owner.

number of airbags
type: DatatypeProperty
is part of: auto.schema.org
source: Automotive Ontology Working Group
domain: vehicle
range: Datatype
  union of: decimal
  union of: string
definition: The number or type of airbags in the vehicle.

number of axles
type: ObjectProperty
is part of: auto.schema.org
source: Automotive Ontology Working Group
domain: vehicle
range: QuantitativeValueInteger
definition: The number of axles. Typical unit code(s): C62

number of doors
type: DatatypeProperty
is part of: auto.schema.org
source: Automotive Ontology Working Group
domain: vehicle
range: decimal
definition: The number of doors. Typical unit code(s): C62

number of drivers
type: DatatypeProperty
domain: Class
  union of: ownership info
  union of: vehicle
range: integer
definition: The number of people who were/are regularly driving the vehicle in the respective period of time (when attached to uco:OwnershipInfo) or in total (when directly applied to a vso:Vehicle)

number of forward gears
type: ObjectProperty
is part of: auto.schema.org
source: Automotive Ontology Working Group
domain: vehicle
range: QuantitativeValueInteger
definition: The total number of forward gears available for the transmission system of the vehicle. Typical unit code(s): C62

number of owners
type: DatatypeProperty
domain: vehicle
range: integer
definition: The total number of people or organizations who owned the vehicle, including the current owner. Note that this value can be higher (but not lower) than the number of uco:OwnershipInfo nodes, since those records may be incomplete.

has number of passengers
type: DatatypeProperty
domain: vehicle
range: int
definition: relates a vehicle to the number of passengers it contains

offer promo code
type: DatatypeProperty
domain: offering
range: string
definition: The code for a promotional offer

original parts only
type: DatatypeProperty
domain: Class
  union of: damage or accident
  union of: modification or maintenance
range: boolean
definition: This indicates whether the parts used for repairing a damage, for a maintenance task, or a modification were all original.

otr retail price
type: ObjectProperty
domain: financing
range: price specification
definition: Indicates the OTR retail price for the financing

owner
type: ObjectProperty
domain: ownership info
domain: vehicle
range: business entity
definition: This property points to the owner of the vehicle for the respective period of time, as indicated by the uco:OwnershipInfo node.

parking
type: ObjectProperty
domain: ownership info
domain: vehicle
range: parking type
definition: The main type(s) of parking that have been used for the vehicle during the period of ownership (if attached to uco:OwnershipInfo) or in general (if attached to the vso:Vehicle directly)

part added
type: DatatypeProperty
domain: modification or maintenance
range: Literal
definition: A textual description of the part or parts added in the modification (e.g. tuning) or maintenance task

part removed
type: DatatypeProperty
domain: modification or maintenance
range: Literal
definition: A textual description of the part or parts removed in the modification (e.g. tuning) or maintenance task

part replaced
type: DatatypeProperty
domain: modification or maintenance
range: Literal
definition: A textual description of the part or parts replaced in the modification (e.g. tuning) or maintenance (e.g. new engine) task

payload
type: ObjectProperty
is part of: auto.schema.org
source: Automotive Ontology Working Group
domain: vehicle
range: quantitative value float
definition: The permitted weight of passengers and cargo, EXCLUDING the weight of the empty vehicle. Typical unit code(s): KGM for kilogram, LBR for pound Note 1: Many databases specify the permitted TOTAL weight instead, which is the sum of weight and payload Note 2: You can indicate additional information in the name of the QuantitativeValue node. Note 3: You may also link to a QualitativeValue node that provides additional information using valueReference. Note 4: Note that you can use minValue and maxValue to indicate ranges.

pets
type: ObjectProperty
domain: ownership info
domain: vehicle
range: species
definition: The type(s) of animals that have been transported in the vehicle during the period of ownership (if attached to uco:OwnershipInfo) or in general (if attached to the vso:Vehicle directly). If possible, use DBPedia URIs, e.g. http://dbpedia.org/resource/Dog.

price modiﬁer
type: ObjectProperty
range: relative price specification
definition: Links a coo:ConfigurationInfo node to information on a choice or component or the combination of multiple choices will affect the regular pricing of the resulting vehicle Note: The use of gr:addOn is in general a better way of modeling surcharges

product code
type: DatatypeProperty
range: string
definition: The Volkswagen-specific product code for the vehicle model, choice, component, spare part, or service

production date
type: DatatypeProperty
is part of: auto.schema.org
source: Automotive Ontology Working Group
domain: vehicle
range: dateTime
definition: The date of production of the item, e.g. vehicle.
definition: The date of production of the vehicle. This property should be used mainly with gr:ActualProductOrServiceInstance.

property ID
type: DatatypeProperty
domain: property value
range: Literal
definition: A global identifier, e.g. a URI, a prefixed string, or any other identifier that can be used to refer to a standardized property type

property name
type: DatatypeProperty
domain: property value
range: Literal
definition: The name of the property

property value
type: DatatypeProperty
domain: property value
range: Literal
definition: The value of of the property

purchase date
type: DatatypeProperty
is part of: auto.schema.org
source: Automotive Ontology Working Group
domain: vehicle
range: dateTime
definition: The date the item e.g. vehicle was purchased by the current owner.

reference distance
type: ObjectProperty
sub property of: value reference
domain: quantitative value float
range: quantitative value
definition: The distance to which a vso:fuelConsumption value refers

reference fuel quantity
type: ObjectProperty
sub property of: value reference
domain: quantitative value float
range: fuel quantity
definition: The quantity of fuel to which a vso:fuelEconomy value refers

reference speeds
type: ObjectProperty
sub property of: value reference
domain: quantitative value float
range: speed interval
definition: The interval of initial and target speed to which a vso:acceleration value refers

refers to traffic pattern
type: ObjectProperty
sub property of: value reference
domain: quantitative value
range: traffic pattern value
definition: Indicates the traffic pattern to which the vso:fuelEconomy or vso:fuelConsumption value refers

rental usage
type: DatatypeProperty
domain: vehicle
range: boolean
definition: Indicates whether the vehicle has been used for commercial rental. The legislation in many countries requires this information to be revealed when offering a car for sale. Note 1: This property should be used with gr:ActualProductOrServiceInstance (when offering a vehicle) or gr:ProductOrServicesSomeInstancesPlaceholder (when seeking a vehicle using gr:seeks) only. Note 2: This property is relevant mainly for offers to SELL the vehicle (gr:hasBusinessFunction gr:Sell).

repaired
type: DatatypeProperty
domain: Class
  union of: damage or accident
  union of: vehicle
range: boolean
definition: This indicates whether damages resulting from a certain uco:DamageOrAccident (when attached to this type) or all damages (when directly attached to a vso:Vehicle) have been properly repaired. Do not use this propery on a vso:Vehicle if it never had a damage.

roof load
type: ObjectProperty
is part of: auto.schema.org
source: Automotive Ontology Working Group
range: quantitative value float
definition: The permitted total weight of cargo and installations (e.g. a roof rack) on top of the vehicle. Typical unit code(s): KGM for kilogram, LBR for pound Note 1: You can indicate additional information in the name of the QuantitativeValue node. Note 2: You may also link to a QualitativeValue node that provides additional information using valueReference Note 3: Note that you can use minValue and maxValue to indicate ranges.

rotational speed reference
type: ObjectProperty
sub property of: value reference
domain: quantitative value
range: quantitative value
definition: The rotational speed to which a vvo:torque or vso:enginePower value refers Typical unit code(s): RPM for revolutions per minute or RPS for revolutions per second

scrappage contribution
type: ObjectProperty
domain: financing
range: price specification
definition: Indicates the scrappage contribution for the financing

seating capacity
type: ObjectProperty
is part of: auto.schema.org
source: Automotive Ontology Working Group
domain: vehicle
range: QuantitativeValueInteger
definition: The number of passengers that can be seated in the vehicle, both in terms of the physical space available, and in terms of limitations set by law. Typical unit code(s): C62 for persons.
definition: The number of persons that can be seated (e.g. in a vehicle), both in terms of the physical space available, and in terms of limitations set by law. Typical unit code(s): C62 for persons
synonym: vehicle seating capacity

serial number
type: DatatypeProperty
definition: relates a vehicle to its serial number

short subtitle
type: DatatypeProperty
domain: Class
  union of: financing
  union of: offering
  union of: vehicle
range: PlainLiteral
definition: The short subtitle for a vehicle, component, offer, or financing option

short title
type: DatatypeProperty
domain: Class
  union of: financing
  union of: offering
  union of: vehicle
range: PlainLiteral
definition: The short title for a vehicle, component, offer, or financing option

smoking
type: DatatypeProperty
domain: Class
  union of: ownership info
  union of: vehicle
range: boolean
definition: This property indicates whether it has been smoked inside the car in the respective period of time (when attached to uco:OwnershipInfo) or ever (when directly applied to a vso:Vehicle).

speed
type: ObjectProperty
is part of: auto.schema.org
source: Automotive Ontology Working Group
domain: vehicle
range: quantitative value float
definition: The speed range of the vehicle. If the vehicle is powered by an engine, the upper limit of the speed range (indicated by maxValue should be the maximum speed achievable under regular conditions. Typical unit code(s): KMH for km/h, HM for mile per hour (0.447 04 m/s), KNT for knot *Note 1: Use minValue and maxValue to indicate the range. Typically, the minimal value is zero. * Note 2: There are many different ways of measuring the speed range. You can link to information about how the given value has been determined using the valueReference property.

steering position
type: ObjectProperty
sub property of: topObjectProperty
is part of: auto.schema.org
source: Automotive Ontology Working Group
domain: vehicle
range: steering position value
definition: The position of the steering wheel or similar device (mostly for cars)
definition: The position of the steering wheel or similar device (mostly for cars).

structural damage
type: DatatypeProperty
domain: Class
  union of: damage or accident
  union of: vehicle
range: boolean
definition: This property indicates whether the vehicle has suffered from structural damage in the respective accident (when attached to uco:DamageOrAccident) or ever (when directly applied to a vso:Vehicle).

subtitle
type: DatatypeProperty
domain: Class
  union of: financing
  union of: offering
  union of: vehicle
range: PlainLiteral
definition: The subtitle for a vehicle, component, offer, or financing option

terms and conditions
type: DatatypeProperty
domain: Class
  union of: financing
  union of: offering
  union of: vehicle
range: PlainLiteral
definition: Terms and conditions of the service, offer, or financing option

to
type: DatatypeProperty
domain: ownership info
range: dateTime
definition: This property indicates the end of the period of ownership represented by this uco:OwnershipInfo node.

torque
type: ObjectProperty
is part of: auto.schema.org
source: Automotive Ontology Working Group
domain: engine specification
range: quantitative value
definition: The torque (turning force) of an engine Typical unit code(s): NU for newton metre (N m), F17 for pound-force per foot, or F48 for pound-force per inch
definition: The torque (turning force) of the vehicle's engine. Typical unit code(s): NU for newton metre (N m), F17 for pound-force per foot, or F48 for pound-force per inch Note 1: You can link to information about how the given value has been determined (e.g. reference RPM) using the valueReference property. Note 2: You can use minValue and maxValue to indicate ranges.

total payable
type: ObjectProperty
domain: financing
range: price specification
definition: Indicates the total payable for the financing

trailer weight
type: ObjectProperty
is part of: auto.schema.org
source: Automotive Ontology Working Group
domain: vehicle
range: quantitative value float
definition: The permitted vertical load (TWR) of a trailer attached to the vehicle. Also referred to as Tongue Load Rating (TLR) or Vertical Load Rating (VLR) Typical unit code(s): KGM for kilogram, LBR for pound Note 1: You can indicate additional information in the name of the QuantitativeValue node. Note 2: You may also link to a QualitativeValue node that provides additional information using valueReference. Note 3: Note that you can use minValue and maxValue to indicate ranges.
definition: The permitted weight of a trailer attached to the vehicle. Typical unit code(s): KGM for kilogram, LBR for pound Note 1: You can indicate additional information in the name of the QuantitativeValue node. Note 2: You may also link to a QualitativeValue node that provides additional information using valueReference. Note 3: Note that you can use minValue and maxValue to indicate ranges.
synonym: tongue weight

transmission
type: ObjectProperty
sub property of: topObjectProperty
range: transmission type value
definition: The type of component used for transmitting the power from a rotating power source to the wheels or propeller(s) ("gearbox" for cars). Use DBPedia resources to indicate the transmission type, if possible. Popular identifiers are http://dbpedia.org/resource/Manual_transmission http://dbpedia.org/resource/Automatic_transmission If you cannot find a suitable identifier in DBPedia, define your own as an instance of vso:TransmissionTypeValue.

type
type: DatatypeProperty
domain: car
range: Literal
definition: This property represents an internal type of vehicle.

unit code
type: DatatypeProperty
domain: property value
range: string
definition: A UN/CEFACT Common Code for indicating the unit of measurement of the value, if available

unit text
type: DatatypeProperty
domain: property value
range: Literal
definition: A string or text indicating the unit of measurement. Useful if you cannot provide a standard unit code for uco:unitCode.

usage
type: ObjectProperty
domain: ownership info
domain: vehicle
range: car usage
definition: The type(s) of usage during the period of ownership (if attached to uco:OwnershipInfo) or in general (if attached to the vso:Vehicle directly)

valid
type: DatatypeProperty
domain: configuration info
range: boolean
definition: Indicates whether the attached set of choices is a valid (true) or invalid (false) configuration for the Derivative

valid from
type: DatatypeProperty
domain: check
range: dateTime
definition: This property indicates the beginning of the validity of the inspection represented by the uco:Check node. This is typically the day of the inspection.

valid to
type: DatatypeProperty
domain: check
range: dateTime
definition: This property indicates the end of the validity of the inspection represented by the uco:Check node. This is typically the day of the inspection plus one (UK MOT) or two years (e.g. German TÜV).

valuation
type: ObjectProperty
domain: vehicle
range: price specification
definition: The market price assessment gained by the respective valuation. Use gr:name to indicate the name of the valuation service.

variant
type: DatatypeProperty
range: Literal
definition: This property represents an internal variant code.

vehicle configuration
type: DatatypeProperty
is part of: auto.schema.org
source: Automotive Ontology Working Group
domain: vehicle
range: string
definition: A short text indicating the configuration of the vehicle, e.g. '5dr hatchback ST 2.5 MT 225 hp' or 'limited edition'.

vehicle engine
type: ObjectProperty
is part of: auto.schema.org
source: Automotive Ontology Working Group
domain: vehicle
range: engine specification
definition: Information about the engine or engines of the vehicle.

vehicle identification number
type: DatatypeProperty
sub property of: serial number
is part of: auto.schema.org
source: Automotive Ontology Working Group
domain: vehicle
range: string
definition: A unique serial number used by the automotive industry to identify individual motor vehicles
definition: The Vehicle Identification Number (VIN) is a unique serial number used by the automotive industry to identify individual motor vehicles.
abbreviation: VIN
synonym: VIN
synonym: Vehicle Identification Number

vehicle interior color
type: DatatypeProperty
is part of: auto.schema.org
source: Automotive Ontology Working Group
domain: vehicle
range: string
definition: The color or color combination of the interior of the vehicle.

vehicle interior type
type: DatatypeProperty
is part of: auto.schema.org
source: Automotive Ontology Working Group
domain: vehicle
range: string
definition: The type or material of the interior of the vehicle (e.g. synthetic fabric, leather, wood, etc.). While most interior types are characterized by the material used, an interior type can also be based on vehicle usage or target audience.

vehicle model date
type: DatatypeProperty
is part of: auto.schema.org
source: Automotive Ontology Working Group
domain: vehicle
range: dateTime
definition: The release date of a vehicle model (often used to differentiate versions of the same make and model)
definition: The release date of a vehicle model (often used to differentiate versions of the same make and model).

vehicle special usage
type: ObjectProperty
is part of: auto.schema.org
source: Automotive Ontology Working Group
domain: vehicle
definition: Indicates whether the vehicle has been used for special purposes, like commercial rental, driving school, or as a taxi. The legislation in many countries requires this information to be revealed when offering a car for sale.

vehicle transmission
type: ObjectProperty
is part of: auto.schema.org
source: Automotive Ontology Working Group
domain: vehicle
range: Class
  union of: qualitative value
  union of: text value
definition: The type of component used for transmitting the power from a rotating power source to the wheels or other relevant component(s) ("gearbox" for cars).

vehicle type approved category
type: DatatypeProperty
range: Literal
definition: This property represents a category of the approved vehicle type.

version
type: DatatypeProperty
domain: vehicle
range: Literal
definition: This property represents an internal version code of a vehicle.

weight total
type: ObjectProperty
is part of: auto.schema.org
source: Automotive Ontology Working Group
domain: vehicle
range: quantitative value float
definition: The permitted total weight of the loaded vehicle, including passengers and cargo and the weight of the empty vehicle. Typical unit code(s): KGM for kilogram, LBR for pound Note 1: You can indicate additional information in the name of the QuantitativeValue node. Note 2: You may also link to a QualitativeValue node that provides additional information using valueReference. Note 3: Note that you can use minValue and maxValue to indicate ranges.

wheelbase
type: ObjectProperty
is part of: auto.schema.org
source: Automotive Ontology Working Group
domain: vehicle
range: quantitative value float
definition: The distance between the centers of the front and rear wheels. Typical unit code(s): CMT for centimeters, MTR for meters, INH for inches, FOT for foot/feet

width
type: ObjectProperty
domain: vehicle
range: quantitative value float
definition: The outer width of the vehicle. Note that you can use gr:hasMinValueFloat and gr:hasMaxValueFloat to indicate ranges. Typical unit code(s): CMT for centimeters, MTR for meters, INH for inches, FOT for foot/feet

width excluding door mirrors
type: ObjectProperty
sub property of: width
definition: The outer width of the vehicle, excluding door mirrors. Note that you can use gr:hasMinValueFloat and gr:hasMaxValueFloat to indicate ranges. Typical unit code(s): CMT for centimeters, MTR for meters, INH for inches, FOT for foot/feet

width with doors open
type: ObjectProperty
sub property of: width
definition: The outer width of the vehicle with the doors open. Note that you can use gr:hasMinValueFloat and gr:hasMaxValueFloat to indicate ranges. Typical unit code(s): CMT for centimeters, MTR for meters, INH for inches, FOT for foot/feet

Axiom
annotated property: definition
annotated source: covered farm vehicle
annotated target: straight truck or articulated vehicle that is registered in a State with a license plate or other designation issued by the State of registration that allows law enforcement officials to identify it as a farm vehicle and used to transport agricultural commodities, livestock, machinery or supplies to or from a farm or ranch
adapted from: 49 C.F.R. § 390.5

Axiom
annotated property: definition
annotated source: agricultural commodity trailer
annotated target: trailer that is designed to transport bulk agricultural commodities in off-road harvesting sites and to a processing plant or storage location, as evidenced by skeletal construction that accommodates harvest containers, a maximum length of 28 feet, and an arrangement of air control lines and reservoirs that minimizes damage in field operations
adapted from: 49 C.F.R. § 393.5

Axiom
annotated property: definition
annotated source: boat trailer
annotated target: trailer designed with cradle-type mountings to transport a boat and configured to permit the launching of the boat from the rear of the trailer
adapted from: 49 C.F.R. § 393.5

Axiom
annotated property: definition
annotated source: container chassis trailer
annotated target: semitrailer of skeleton construction limited to a bottom frame, one or more axles, specially built and fitted with locking devices for the transport of intermodal cargo containers so that when the chassis and container are assembled, the units serve the same function as an over the road trailer
adapted from: 49 C.F.R. § 393.5

Axiom
annotated property: definition
annotated source: crib-type log trailer
annotated target: trailer equipped with stakes, bunks, a front-end structure, and a rear structure to restrain logs
adapted from: 49 C.F.R. § 393.5

Axiom
annotated property: definition
annotated source: heavy hauler trailer
annotated target: trailer whose brakes lines are designed to adapt to separation or extension of the vehicle frame and/or which body consists only of a platform whose primary cargo-carrying surface is not more than 1,016 mm (40 inches) above the ground in an unloaded condition, except that it may include sides that are designed to be easily removable and a permanent “front-end structure”, but that is not a container chassis trailer
adapted from: 49 C.F.R. § 393.5

Axiom
annotated property: definition
annotated source: road construction controlled horizontal discharge trailer
annotated target: trailer or semitrailer that is equipped with a mechanical drive and a conveyor to deliver asphalt and other road building materials, in a controlled horizontal manner, into a lay down machine or paving equipment for road construction and paving operations
adapted from: 49 C.F.R. § 393.5

Axiom
annotated property: definition
annotated source: pulpwood trailer
annotated target: trailer or semitrailer that is designed exclusively for harvesting logs or pulpwood and constructed with a skeletal frame with no means for attachment of a solid bed, body, or container
adapted from: 49 C.F.R. § 393.5

Axiom
annotated property: definition
annotated source: straddle trailer
annotated target: trailer that is designed to transport bulk agricultural commodities from the harvesting location, as evidenced by a framework that is driven over the cargo and lifting arms that suspend the cargo for transit
adapted from: 49 C.F.R. § 393.5

Axiom
annotated property: definition
annotated source: tractor pole trailer
annotated target: combination vehicle that carries logs lengthwise so that they form the body of the vehicle
adapted from: 49 C.F.R. § 393.5

Axiom
annotated property: definition
annotated source: price specification
annotated target: indication of the unit price and delivery or payment charges
adapted from: https://schema.org/priceSpecification

Axiom
annotated property: definition
annotated source: road vehicle
annotated target: land vehicle other than a railway vehicle
adapted from: ANSI D.16-2017, section 2.2.6