Vehicle signals ontology (VS)
type: Ontology
comment: The GENIVI VSS Ontology (VSSO) has been initially created by Benjamin Klotz, Daniel Wilms, and Raphael Troncy (see http://automotive.eurecom.fr/vsso). VSSO, as created by Benjamin Klotz, Daniel Wilms, and Raphael Troncy, is available under the Creative Commons Attribution 4.0 International license; see http://creativecommons.org/licenses/by/4.0/. VSSO describes the car's attributes, branches and signals defined in GENIVI's Vehicle Signal Specification.
abstract: This Vehicle Signals Ontology (VSSO) describes the car's parts and signals. It is based on the GENIVI's Vehicle Signal Specification.
created: 2018-01-10T00:00:00
license: http://creativecommons.org/licenses/by/4.0/
file abbreviation: auto-ec-vsso
filename: VehicleSignals.rdf
imports: VehicleParts
imports: AnnotationVocabulary
has maturity level: Provisional

vehicle part
type: Class

Error
type: Class
subclass of: Observable signal
subclass of: Restriction
  on property: unit
  all values from: DimensionlessUnit
subclass of: Restriction
  on property: isObservedBy
  all values from: Antilock braking system
definition: Signal.ADAS.ABS.Error : Indicates if ABS incurred an error condition. True = Error. False = No Error.

IsActive
type: Class
subclass of: Actuable signal
subclass of: Observable signal
subclass of: Restriction
  on property: unit
  all values from: DimensionlessUnit
subclass of: Restriction
  on property: isActuatedBy
  all values from: Antilock braking system
subclass of: Restriction
  on property: isObservedBy
  all values from: Antilock braking system
definition: Signal.ADAS.ABS.IsActive : Indicates if ABS is enabled. Tue = Enabled. False = Disabled.

IsEngaged
type: Class
subclass of: Observable signal
subclass of: Restriction
  on property: unit
  all values from: DimensionlessUnit
subclass of: Restriction
  on property: isObservedBy
  all values from: Antilock braking system
definition: Signal.ADAS.ABS.IsEngaged : Indicates if ABS is currently regulating brake pressure. True = Engaged. False = Not Engaged.

AbsoluteLoad
type: Class
subclass of: Observable signal
subclass of: Restriction
  on property: unit
  all values from: DimensionlessUnit
subclass of: Restriction
  on property: isObservedBy
  all values from: diagnostic system
definition: Signal.OBD.AbsoluteLoad : PID 43 - Absolute load value

PedalPosition
type: Class
subclass of: Observable signal
subclass of: Restriction
  on property: unit
  all values from: DimensionlessUnit
subclass of: Restriction
  on property: isObservedBy
  all values from: Pedal position sensor
definition: Signal.Chassis.Accelerator.PedalPosition : Accelerator pedal position as percent. 0 = Not depressed. 100 = Fully depressed.

AcceleratorPositionD
type: Class
subclass of: Observable signal
subclass of: Restriction
  on property: unit
  all values from: DimensionlessUnit
subclass of: Restriction
  on property: isObservedBy
  all values from: Pedal position sensor
definition: Signal.OBD.AcceleratorPositionD/E/F : PID 49/4A/4B - Accelerator pedal position D/E/F

Accelerometer
type: Class
subclass of: vehicle sensor
definition: Sensor measuring the linear acceleration

DriveTime
type: Class
subclass of: Observable signal
subclass of: Restriction
  on property: unit
  all values from: TimeUnit
subclass of: Restriction
  on property: isObservedBy
  all values from: Timer
definition: Signal.Vehicle.DriveTime : Accumulated drive time in seconds.

IdleTime
type: Class
subclass of: Observable signal
subclass of: Restriction
  on property: unit
  all values from: TimeUnit
subclass of: Restriction
  on property: isObservedBy
  all values from: Timer
definition: Signal.Vehicle.IdleTime : Accumulated idle time in seconds.

IgnitionOffTime
type: Class
subclass of: Observable signal
subclass of: Restriction
  on property: unit
  all values from: TimeUnit
subclass of: Restriction
  on property: isObservedBy
  all values from: Timer
definition: Signal.Vehicle.IgnitionOffTime : Accumulated ignition off time in seconds.

IgnitionOnTime
type: Class
subclass of: Observable signal
subclass of: Restriction
  on property: unit
  all values from: TimeUnit
subclass of: Restriction
  on property: isObservedBy
  all values from: Timer
definition: Signal.Vehicle.IgnitionOnTime : Accumulated ignition on time in seconds.

TravelledDistance
type: Class
subclass of: Observable signal
subclass of: Restriction
  on property: unit
  all values from: LengthUnit
subclass of: Restriction
  on property: isObservedBy
  all values from: Odometer
definition: Signal.Vehicle.TravelledDistance : Odometer reading

Actuable signal
type: ObjectProperty
type: Class
definition: All actuable signals that can dynamically be updated by the vehicle

Air conditioning system
type: Class
subclass of: Actuator
subclass of: vehicle sensor
definition: Air conditioning system

AirDistribution
type: Class
subclass of: Actuable signal
subclass of: Observable signal
subclass of: Restriction
  on property: unit
  all values from: DimensionlessUnit
subclass of: Restriction
  on property: isActuatedBy
  all values from: Fan control
subclass of: Restriction
  on property: isObservedBy
  all values from: Fan sensor
definition: Signal.Cabin.HVAC.RowX.Left/Right.AirDistribution : Direction of airstream

AirStatus
type: Class
subclass of: Actuable signal
subclass of: Observable signal
subclass of: Restriction
  on property: unit
  all values from: DimensionlessUnit
subclass of: Restriction
  on property: isActuatedBy
  all values from: diagnostic system
subclass of: Restriction
  on property: isObservedBy
  all values from: diagnostic system
definition: Signal.OBD.AirStatus : PID 12 - Secondary air status

IsDeployed
type: Class
subclass of: Observable signal
subclass of: Restriction
  on property: isObservedBy
  all values from: Airbag system
definition: Signal.Cabin.Seat.RowX.PosY.Airbag.IsDeployed : Airbag deployment status. True = Airbag deployed. False = Airbag not deployed.

Airbag system
type: Class
subclass of: vehicle sensor
definition: Sensor measuring if the airbag is deployed

Longitude
type: Class
subclass of: Observable signal
subclass of: Restriction
  on property: unit
  all values from: LengthUnit
subclass of: Restriction
  on property: isObservedBy
  all values from: Global positioning system
definition: Signal.Cabin.Infotainment.Navigation.CurrentLocation.Altitude : Current elevation of the position in meters.

AmbientAirTemperature
type: Class
subclass of: Observable signal
subclass of: Restriction
  on property: unit
  all values from: TemperatureUnit
subclass of: Restriction
  on property: isObservedBy
  all values from: Thermometer
definition: Signal.Vehicle.AmbientAirTemperature / Signal.Cabin.HVAC.AmbientAirTemperature / Signal.Drivetrain.InternalCombustionEngine.Engine.AmbientAirTemperature / Signal.OBD.AmbientAirTemperature / PID 46 : Ambient air temperature (outside)

AmbientLight
type: Class
subclass of: Observable signal
subclass of: Restriction
  on property: unit
  all values from: DimensionlessUnit
subclass of: Restriction
  on property: isObservedBy
  all values from: Light sensor
definition: Signal.Cabin.Lights.AmbientLight : How much ambient light is detected in cabin. 0 = No ambient light. 100 = Full brightness

Antilock braking system
type: Class
subclass of: Actuator
subclass of: vehicle sensor
definition: Appliance that allows thes wheels to maintain tractive contact by prevent them from locking up

AuxInputStatus
type: Class
subclass of: Actuable signal
subclass of: Observable signal
subclass of: Restriction
  on property: unit
  all values from: DimensionlessUnit
subclass of: Restriction
  on property: isActuatedBy
  all values from: diagnostic system
subclass of: Restriction
  on property: isObservedBy
  all values from: diagnostic system
definition: Signal.OBD.AuxInputStatus : PID 1E - Auxiliary input status (power take off)

AverageConsumption
type: Class
subclass of: Observable signal
subclass of: Restriction
  on property: unit
  all values from: VolumePerDistanceUnit
subclass of: Restriction
  on property: isObservedBy
  all values from: Flow sensor
definition: Signal.Drivetrain.FuelSystem.AverageConsumption : Average consumption in liters per 100 km.

Backup light
type: Class
subclass of: Actuator
definition: Turns on and off the backup light

Backup light switch
type: Class
subclass of: vehicle sensor
definition: Senses if the backup light switch is on

bank 2
type: Class
subclass of: vehicle sensor

barometer
type: Class
subclass of: vehicle sensor

BarometricPressure
type: Class
subclass of: Observable signal
subclass of: Restriction
  on property: unit
  all values from: PressureOrStressUnit
subclass of: Restriction
  on property: isObservedBy
  all values from: barometer
definition: Signal.OBD.BarometricPressure : PID 33 - Barometric pressure

BatteryCapacity
type: Class
subclass of: Observable signal
subclass of: Restriction
  on property: unit
  all values from: DimensionlessUnit
subclass of: Restriction
  on property: isObservedBy
  all values from: Battery monitor
definition: Signal.Drivetrain.BatteryManagement.BatteryCapacity : Remaining capacity of the batter pack

Battery monitor
type: Class
subclass of: vehicle sensor
definition: Sensor measuring the capacity of a battery

battery sensor
type: Class
subclass of: vehicle sensor

BatteryTemperature
type: Class
subclass of: Observable signal
subclass of: Restriction
  on property: unit
  all values from: TemperatureUnit
subclass of: Restriction
  on property: isObservedBy
  all values from: Thermometer
definition: Signal.Drivetrain.BatteryManagement.BatteryTemperature : Temperature of the battery pack

Belt sensor
type: Class
subclass of: vehicle sensor
definition: Sensor measuring if a seat is belted

FluidLevel
type: Class
subclass of: Observable signal
subclass of: Restriction
  on property: unit
  all values from: DimensionlessUnit
subclass of: Restriction
  on property: isObservedBy
  all values from: Brake fluid level sensor
definition: Signal.Chassis.Axle.RowX.Wheel.Left/Right.Brake.FluidLevel : Brake fluid level as percent. 0 = Empty. 100 = Full.

FluidLevelLow
type: Class
subclass of: Observable signal
subclass of: Restriction
  on property: unit
  all values from: DimensionlessUnit
subclass of: Restriction
  on property: isObservedBy
  all values from: Brake fluid level sensor
definition: Signal.Chassis.Axle.RowX.Wheel.Left/Right.Brake.FluidLevelLow : Brake fluid level status. True = Brake fluid level low. False = Brake fluid level OK.

Brake fluid level sensor
type: Class
subclass of: vehicle sensor
definition: Sensor measuring the brake fluid level

Brake light
type: Class
subclass of: Actuator
definition: Turns on and off the brake light

Brake light switch
type: Class
subclass of: vehicle sensor
definition: Senses if the brake light switch is on

Brake padwear sensor
type: Class
subclass of: vehicle sensor
definition: Sensor measuring the padwear of a brake

PedalPosition
type: Class
subclass of: Observable signal
subclass of: Restriction
  on property: unit
  all values from: DimensionlessUnit
subclass of: Restriction
  on property: isObservedBy
  all values from: Pedal position sensor
definition: Signal.Chassis.Brake.PedalPosition : Brake pedal position as percent. 0 = Not depressed. 100 = Fully depressed.

BrakesWorn
type: Class
subclass of: Observable signal
subclass of: Restriction
  on property: isObservedBy
  all values from: Brake padwear sensor
definition: Signal.Chassis.Axle.RowX.Wheel.Left/Right.Brake.BrakesWorn : Brake pad wear status. True = Worn. False = Not Worn.

CAN
type: Class
subclass of: Sensor

camera
type: Class
subclass of: Sensor

Temperature1
type: Class
subclass of: Observable signal
subclass of: Restriction
  on property: unit
  all values from: TemperatureUnit
subclass of: Restriction
  on property: isObservedBy
  all values from: catalyst temperature sensor
definition: Signal.OBD.Catalyst.BankX.TemperatureY : PID 3C->3F - Catalyst temperature from bank X, sensor Y

catalyst temperature sensor
type: Class
subclass of: vehicle sensor

Child lock
type: Class
subclass of: Actuator
subclass of: vehicle sensor
definition: Child lock

ClutchWear
type: Class
subclass of: Observable signal
subclass of: Restriction
  on property: unit
  all values from: DimensionlessUnit
subclass of: Restriction
  on property: isObservedBy
  all values from: Clutch wear indicator
definition: Signal.Drivetrain.Transmission.ClutchWear : Clutch wear as a percent. 0 = no wear. 100 = worn.

Clutch wear indicator
type: Class
subclass of: vehicle sensor
definition: Sensor measuring the wear of the clutch

CommandedEGR
type: Class
subclass of: Observable signal
subclass of: Restriction
  on property: unit
  all values from: DimensionlessUnit
subclass of: Restriction
  on property: isObservedBy
  all values from: EGR system monitor
definition: Signal.OBD.CommandedEGR : PID 2C - Commanded exhaust gas recirculation (EGR)

CommandedEVAP
type: Class
subclass of: Actuable signal
subclass of: Observable signal
subclass of: Restriction
  on property: unit
  all values from: DimensionlessUnit
subclass of: Restriction
  on property: isActuatedBy
  all values from: EVAP system
subclass of: Restriction
  on property: isObservedBy
  all values from: EVAP system
definition: Signal.OBD.CommandedEVAP : PID 2E - Commanded evaporative purge (EVAP) valve

CommandedEquivalenceRatio
type: Class
subclass of: Observable signal
subclass of: Restriction
  on property: unit
  all values from: DimensionlessUnit
subclass of: Restriction
  on property: isObservedBy
  all values from: diagnostic system
definition: Signal.OBD.CommandedEquivalenceRatio : PID 44 - Commanded equivalence ratio

ConsumptionSinceStart
type: Class
subclass of: Observable signal
subclass of: Restriction
  on property: unit
  all values from: VolumeUnit
subclass of: Restriction
  on property: isObservedBy
  all values from: Flow sensor
definition: Signal.Drivetrain.FuelSystem.ConsumptionSinceStart : Fuel amount consumed since start in liters.

ControlModuleVoltage
type: Class
subclass of: Observable signal
subclass of: Restriction
  on property: unit
  all values from: EnergyPerElectricChargeUnit
subclass of: Restriction
  on property: isObservedBy
  all values from: voltage sensor
definition: Signal.OBD.ControlModuleVoltage : PID 42 - Control module voltage

CoolantTemperature
type: Class
subclass of: Observable signal
subclass of: Restriction
  on property: unit
  all values from: TemperatureUnit
subclass of: Restriction
  on property: isObservedBy
  all values from: coolant temperature sensor
definition: Signal.OBD.CoolantTemperature : PID 05 - Coolant temperature

coolant temperature sensor
type: Class
subclass of: vehicle sensor

Coolant thermometer
type: Class
subclass of: vehicle sensor
definition: Sensor measuring the temperature of the coolant fluid

crankshaft position sensor
type: Class
subclass of: vehicle sensor

Error
type: Class
subclass of: Observable signal
subclass of: Restriction
  on property: unit
  all values from: DimensionlessUnit
subclass of: Restriction
  on property: isObservedBy
  all values from: Cruise control system
definition: Signal.ADAS.CruiseControl.Error : Indicates if cruise control system incurred and error condition. True = Error. False = NoError.

IsActive
type: Class
subclass of: Actuable signal
subclass of: Observable signal
subclass of: Restriction
  on property: unit
  all values from: DimensionlessUnit
subclass of: Restriction
  on property: isActuatedBy
  all values from: Cruise control system
subclass of: Restriction
  on property: isObservedBy
  all values from: Cruise control system
definition: Signal.ADAS.CruiseControl.IsActive : Indicates if cruise control system is enabled. True = Enabled. False = Disabled.

Cruise control system
type: Class
subclass of: Actuator
subclass of: vehicle sensor
definition: Appliance that automatically controls the speed of a vehicle

Gear
type: Class
subclass of: Actuable signal
subclass of: Observable signal
subclass of: Restriction
  on property: unit
  all values from: DimensionlessUnit
subclass of: Restriction
  on property: isActuatedBy
  all values from: Gearbox system
subclass of: Restriction
  on property: isObservedBy
  all values from: Gearbox system
definition: Signal.Drivetrain.Transmission.Gear : Current gear. 0=Neutral. -1=Reverse

Power
type: Class
subclass of: Observable signal
subclass of: Restriction
  on property: unit
  all values from: PowerUnit
subclass of: Restriction
  on property: isObservedBy
  all values from: Power meter
definition: Signal.Drivetrain.InternalCombustionEngine.Engine.Power : Current engine power output.

TripMeterReading
type: Class
subclass of: Observable signal
subclass of: Restriction
  on property: unit
  all values from: TimeUnit
subclass of: Restriction
  on property: isObservedBy
  all values from: Odometer
definition: Signal.Vehicle.TripMeterReading : Current trip meter reading

Backward
type: Class
subclass of: Actuable signal
subclass of: Restriction
  on property: Actuable signal
  all values from: Cushion position actuator
definition: Signal.Cabin.Seat.RowX.PosY.Switch.Cushion.Backward : Seat cushion backward/shorten switch engaged

Down
type: Class
subclass of: Actuable signal
subclass of: Restriction
  on property: Actuable signal
  all values from: Cushion position actuator
definition: Signal.Cabin.Seat.RowX.PosY.Switch.Cushion.Down : Seat cushion down switch engaged

Forward
type: Class
subclass of: Actuable signal
subclass of: Restriction
  on property: Actuable signal
  all values from: Cushion position actuator
definition: Signal.Cabin.Seat.RowX.PosY.Switch.Cushion.Forward : Seat cushion forward/lengthen switch engaged

Height
type: Class
subclass of: Observable signal
subclass of: Restriction
  on property: unit
  all values from: DimensionlessUnit
subclass of: Restriction
  on property: isObservedBy
  all values from: cushion position sensor
definition: Signal.Cabin.Seat.RowX.PosY.Cushion.Height : Height of the seat front. 0 = Lowermost. 100 = Uppermost.

Length
type: Class
subclass of: Observable signal
subclass of: Restriction
  on property: unit
  all values from: DimensionlessUnit
subclass of: Restriction
  on property: isObservedBy
  all values from: cushion position sensor
definition: Signal.Cabin.Seat.RowX.PosY.Cushion.Length : Forward length of cushion (leg support). 0 = Rearmost. 100 = Forwardmost.

Cushion position actuator
type: Class
subclass of: Actuator
definition: Controls the cushion position

cushion position sensor
type: Class
subclass of: vehicle sensor

Up
type: Class
subclass of: Actuable signal
subclass of: Restriction
  on property: Actuable signal
  all values from: Cushion position actuator
definition: Signal.Cabin.Seat.RowX.PosY.Switch.Cushion.Up : Seat cushion up switch engaged

DTCCount
type: Class
subclass of: Observable signal
subclass of: Restriction
  on property: unit
  all values from: DimensionlessUnit
subclass of: Restriction
  on property: isObservedBy
  all values from: diagnostic system
definition: Signal.OBD.Status.DTCCount : Number of Diagnostic Trouble Codes (DTC)

DeclinedURI
type: Class
subclass of: Observable signal
subclass of: Restriction
  on property: unit
  all values from: anyURI
subclass of: Restriction
  on property: isObservedBy
  all values from: Multimedia system
definition: Signal.Cabin.Infotainment.Media.DeclinedURI : URI of suggested media that was declined

Decrease
type: Class
subclass of: Actuable signal
subclass of: Restriction
  on property: Actuable signal
  all values from: Massage system
definition: Signal.Cabin.Seat.RowX.PosY.Switch.Massage.Decrease : Decrease massage level switch engaged

Deflate
type: Class
subclass of: Actuable signal
subclass of: Restriction
  on property: Actuable signal
  all values from: Lumber pressure actuator
definition: Signal.Cabin.Seat.RowX.PosY.Switch.SideBolster.Deflate : Lumbar deflation switch engaged

Defroster
type: Class
subclass of: Actuator
subclass of: vehicle sensor
definition: Windshield defroster

Latitude
type: Class
subclass of: Actuable signal
subclass of: Observable signal
subclass of: Restriction
  on property: unit
  all values from: AngleUnit
subclass of: Restriction
  on property: isActuatedBy
  all values from: Global positioning system
subclass of: Restriction
  on property: isObservedBy
  all values from: Global positioning system
definition: Signal.Cabin.Infotainment.Navigation.DestinationSet.Latitude : Latitude of destination

Longitude
type: Class
subclass of: Actuable signal
subclass of: Observable signal
subclass of: Restriction
  on property: unit
  all values from: AngleUnit
subclass of: Restriction
  on property: isActuatedBy
  all values from: Global positioning system
subclass of: Restriction
  on property: isObservedBy
  all values from: Global positioning system
definition: Signal.Cabin.Infotainment.Navigation.DestinationSet.Longitude : Longitude of destination

diagnostic system
type: Class
subclass of: vehicle sensor

Dimming system
type: Class
subclass of: Actuator
subclass of: vehicle sensor
definition: Mirror dimming system

DistanceSinceDTCClear
type: Class
subclass of: Observable signal
subclass of: Restriction
  on property: unit
  all values from: LengthUnit
subclass of: Restriction
  on property: isObservedBy
  all values from: diagnostic system
definition: Signal.OBD.DistanceSinceDTCClear : PID 31 - Distance traveled since codes cleared

RearLeft
type: Class
subclass of: Observable signal
subclass of: Restriction
  on property: unit
  all values from: LengthUnit
subclass of: Restriction
  on property: isObservedBy
  all values from: Obstacle detection Sensor
definition: Signal.ADAS.ObstacleDetection.DistanceToObject.Front/Rear/Left/Right : distance to object in meters

DistanceWithMIL
type: Class
subclass of: Observable signal
subclass of: Restriction
  on property: unit
  all values from: LengthUnit
subclass of: Restriction
  on property: isObservedBy
  all values from: Odometer
definition: Signal.OBD.DistanceWithMIL : PID 21 - Distance traveled with MIL on

Dome light
type: Class
subclass of: Actuator
subclass of: vehicle sensor
definition: Dome light

Door contact actuator
type: Class
subclass of: Actuator
definition: Shuts or opens a door

Door contact sensor
type: Class
subclass of: vehicle sensor
definition: Sensor measuring if a door is open or closed

IsLocked
type: Class
subclass of: Actuable signal
subclass of: Observable signal
subclass of: Restriction
  on property: unit
  all values from: DimensionlessUnit
subclass of: Restriction
  on property: isActuatedBy
  all values from: Door lock
subclass of: Restriction
  on property: isObservedBy
  all values from: Door lock
definition: Signal.Cabin.Door.RowX.Left/Right.IsLocked : Is door locked or unlocked. True = Locked. False = Unlocked.

IsOpen
type: Class
subclass of: Actuable signal
subclass of: Observable signal
subclass of: Restriction
  on property: unit
  all values from: DimensionlessUnit
subclass of: Restriction
  on property: isActuatedBy
  all values from: Door contact actuator
subclass of: Restriction
  on property: isObservedBy
  all values from: Door contact sensor
definition: Signal.Cabin.Door.RowX.Left/Right.IsOpen : Is door open or closed

Door lock
type: Class
subclass of: Actuator
subclass of: vehicle sensor
definition: Door lock

Drive system
type: Class
subclass of: Actuator
subclass of: vehicle sensor
definition: Driving mode control

ECT
type: Class
subclass of: Observable signal
subclass of: Restriction
  on property: unit
  all values from: TemperatureUnit
subclass of: Restriction
  on property: isObservedBy
  all values from: Coolant thermometer
definition: Signal.Drivetrain.InternalCombustionEngine.Engine.ECT : Engine coolant temperature.

EGRError
type: Class
subclass of: Observable signal
subclass of: Restriction
  on property: unit
  all values from: DimensionlessUnit
subclass of: Restriction
  on property: isObservedBy
  all values from: EGR system monitor
definition: Signal.OBD.EGRError : PID 2D - Exhaust gas recirculation (EGR) error

EGR system monitor
type: Class
subclass of: vehicle sensor

EOP
type: Class
subclass of: Observable signal
subclass of: Restriction
  on property: unit
  all values from: TemperatureUnit
subclass of: Restriction
  on property: isObservedBy
  all values from: Oil pressure sensor
definition: Signal.Drivetrain.InternalCombustionEngine.Engine.EOP : Engine oil pressure.

Error
type: Class
subclass of: Observable signal
subclass of: Restriction
  on property: unit
  all values from: DimensionlessUnit
subclass of: Restriction
  on property: isObservedBy
  all values from: Electronic stability control system
definition: Signal.ADAS.ESC.Error : Indicates if ESC incurred an error condition. True = Error. False = No Error.

IsActive
type: Class
subclass of: Actuable signal
subclass of: Observable signal
subclass of: Restriction
  on property: unit
  all values from: DimensionlessUnit
subclass of: Restriction
  on property: isActuatedBy
  all values from: Electronic stability control system
subclass of: Restriction
  on property: isObservedBy
  all values from: Electronic stability control system
definition: Signal.ADAS.ESC.IsActive : Indicates if ECS is enabled. Tue = Enabled. False = Disabled.

IsEngaged
type: Class
subclass of: Observable signal
subclass of: Restriction
  on property: unit
  all values from: DimensionlessUnit
subclass of: Restriction
  on property: isObservedBy
  all values from: Electronic stability control system
definition: Signal.ADAS.ESC.IsEngaged : Indicates if ESC is currently regulating vehicle stability. True = Engaged. False = Not Engaged.

EVAP system
type: Class
subclass of: vehicle sensor

EVAPVaporPressure
type: Class
subclass of: Observable signal
subclass of: Restriction
  on property: unit
  all values from: PressureOrStressUnit
subclass of: Restriction
  on property: isObservedBy
  all values from: EVAP system
definition: Signal.OBD.EVAPVaporPressure : PID 32 - Evaporative purge (EVAP) system pressure

EVAPVaporPressureAbsolute
type: Class
subclass of: Observable signal
subclass of: Restriction
  on property: unit
  all values from: PressureOrStressUnit
subclass of: Restriction
  on property: isObservedBy
  all values from: EVAP system
definition: Signal.OBD.EVAPVaporPressureAbsolute : PID 53 - Absolute evaporative purge (EVAP) system pressure

EVAPVaporPressureAlternate
type: Class
subclass of: Observable signal
subclass of: Restriction
  on property: unit
  all values from: PressureOrStressUnit
subclass of: Restriction
  on property: isObservedBy
  all values from: EVAP system
definition: Signal.OBD.EVAPVaporPressureAlternate : PID 54 - Alternate evaporative purge (EVAP) system pressure

Electronic stability control system
type: Class
subclass of: Actuator
subclass of: vehicle sensor
definition: System detecting loss of traction (skidding) and reducing it

EngineLoad
type: Class
subclass of: Observable signal
subclass of: Restriction
  on property: unit
  all values from: DimensionlessUnit
subclass of: Restriction
  on property: isObservedBy
  all values from: diagnostic system
definition: Signal.OBD.EngineLoad : PID 04 - Engine load in percent - 0 = no load, 100 = full load

EOT
type: Class
subclass of: Observable signal
subclass of: Restriction
  on property: unit
  all values from: TemperatureUnit
subclass of: Restriction
  on property: isObservedBy
  all values from: Oil thermometer
definition: Signal.Drivetrain.InternalCombustionEngine.Engine.EOT / Signal.OBD.OilTemperature / PID 5C : Engine oil temperature.

EthanolPercent
type: Class
subclass of: Observable signal
subclass of: Restriction
  on property: unit
  all values from: DimensionlessUnit
subclass of: Restriction
  on property: isObservedBy
  all values from: fluid sensor
definition: Signal.OBD.EthanolPercent : PID 52 - Percentage of ethanol in the fuel

Fan control
type: Class
subclass of: Actuator
definition: Controls a fan speed

Fan sensor
type: Class
subclass of: vehicle sensor
definition: Sensor measuring the fan speed

FanSpeed
type: Class
subclass of: Actuable signal
subclass of: Observable signal
subclass of: Restriction
  on property: unit
  all values from: DimensionlessUnit
subclass of: Restriction
  on property: isActuatedBy
  all values from: Fan control
subclass of: Restriction
  on property: isObservedBy
  all values from: Fan sensor
definition: Signal.Cabin.HVAC.RowX.Left/Right.FanSpeed : Fan Speed, 0 = off. 100 = max

Flow sensor
type: Class
subclass of: vehicle sensor
definition: Sensor measuring the flow of a fluid (fuel)

fluid sensor
type: Class
subclass of: vehicle sensor

FreezeDTC
type: Class
subclass of: Observable signal
subclass of: Restriction
  on property: unit
  all values from: DimensionlessUnit
subclass of: Restriction
  on property: isObservedBy
  all values from: diagnostic system
definition: Signal.OBD.FreezeDTC : PID 02 - DTC that triggered the freeze frame

Front fog light
type: Class
subclass of: Actuator
definition: Turns on and off the front fog light

Front fog position switch
type: Class
subclass of: vehicle sensor
definition: Senses if the front fog light switch is on

FuelInjectionTiming
type: Class
subclass of: Observable signal
subclass of: Restriction
  on property: unit
  all values from: AngleUnit
subclass of: Restriction
  on property: isObservedBy
  all values from: crankshaft position sensor
definition: Signal.OBD.FuelInjectionTiming : PID 5D - Fuel injection timing

FuelPressure
type: Class
subclass of: Observable signal
subclass of: Restriction
  on property: unit
  all values from: PressureOrStressUnit
subclass of: Restriction
  on property: isObservedBy
  all values from: fuel pressure sensor
definition: Signal.OBD.FuelPressure : PID 0A - Fuel pressure

fuel pressure sensor
type: Class
subclass of: vehicle sensor

FuelRailPressureAbsolute
type: Class
subclass of: Observable signal
subclass of: Restriction
  on property: unit
  all values from: PressureOrStressUnit
subclass of: Restriction
  on property: isObservedBy
  all values from: fuel rail pressure sensor
definition: Signal.OBD.FuelRailPressureAbsolute : PID 59 - Absolute fuel rail pressure

FuelRailPressureDirect
type: Class
subclass of: Observable signal
subclass of: Restriction
  on property: unit
  all values from: PressureOrStressUnit
subclass of: Restriction
  on property: isObservedBy
  all values from: fuel rail pressure sensor
definition: Signal.OBD.FuelRailPressureDirect : PID 23 - Fuel rail pressure direct inject

fuel rail pressure sensor
type: Class
subclass of: vehicle sensor

FuelRailPressureVac
type: Class
subclass of: Observable signal
subclass of: Restriction
  on property: unit
  all values from: PressureOrStressUnit
subclass of: Restriction
  on property: isObservedBy
  all values from: fuel rail pressure sensor
definition: Signal.OBD.FuelRailPressureVac : PID 22 - Fuel rail pressure relative to vacuum

FuelRate
type: Class
subclass of: Observable signal
subclass of: Restriction
  on property: unit
  all values from: VolumePerTimeUnit
subclass of: Restriction
  on property: isObservedBy
  all values from: Flow sensor
definition: Signal.OBD.FuelRate : PID 5E - Engine fuel rate

FuelStatus
type: Class
subclass of: Observable signal
subclass of: Restriction
  on property: unit
  all values from: DimensionlessUnit
subclass of: Restriction
  on property: isObservedBy
  all values from: diagnostic system
definition: Signal.OBD.FuelStatus : PID 03 - Fuel status

Fuel tank level sensor
type: Class
subclass of: vehicle sensor
definition: Sensor measuring the fuel tank level

FuelType
type: Class
subclass of: Observable signal
subclass of: Restriction
  on property: unit
  all values from: DimensionlessUnit
subclass of: Restriction
  on property: isObservedBy
  all values from: diagnostic system
definition: Signal.OBD.FuelType : PID 51 - Fuel type

Global positioning system
type: NamedIndividual
type: Class
subclass of: Actuator
subclass of: Sensor
subclass of: vehicle sensor
definition: Global positioning system (GPS)

Accuracy
type: Class
subclass of: Observable signal
subclass of: Restriction
  on property: unit
  all values from: LengthUnit
subclass of: Restriction
  on property: isObservedBy
  all values from: Global positioning system
definition: Signal.Cabin.Infotainment.Navigation.CurrentLocation.Accuracy : Accuracy level of the latitude and longitude coordinates in meters.

Heading
type: Class
subclass of: Observable signal
subclass of: Restriction
  on property: unit
  all values from: AngleUnit
subclass of: Restriction
  on property: isObservedBy
  all values from: Global positioning system
definition: Signal.Cabin.Infotainment.Navigation.CurrentLocation.Heading : Current magnetic compass heading, in degrees.

GearChangeMode
type: Class
subclass of: Actuable signal
subclass of: Observable signal
subclass of: Restriction
  on property: unit
  all values from: DimensionlessUnit
subclass of: Restriction
  on property: isActuatedBy
  all values from: Drive system
subclass of: Restriction
  on property: isObservedBy
  all values from: Drive system
definition: Signal.Drivetrain.Transmission.GearChangeMode : Is the gearbox in automatic or manual (paddle) mode.

Gearbox system
type: Class
subclass of: Actuator
subclass of: vehicle sensor
definition: Gearbox monitoring system

Gearbox temperature
type: Class
subclass of: Observable signal
subclass of: Restriction
  on property: unit
  all values from: TemperatureUnit
subclass of: Restriction
  on property: isObservedBy
  all values from: Thermometer
definition: Signal.Drivetrain.Transmission.Temperature : The current gearbox temperature.

Glove box light
type: Class
subclass of: Actuator
subclass of: vehicle sensor
definition: Glove box light

Gyroscope
type: Class
subclass of: vehicle sensor
definition: Sensor measuring the angular orientation and angular velocity

Hazard light
type: Class
subclass of: Actuator
definition: Turns on and off the hazard light

Hazard light switch
type: Class
subclass of: vehicle sensor
definition: Senses if the hazard light switch is on

Head restraint actuator
type: Class
subclass of: Actuator
definition: Controls the head restraint position

Down
type: Class
subclass of: Actuable signal
subclass of: Restriction
  on property: Actuable signal
  all values from: Head restraint actuator
definition: Signal.Cabin.Seat.RowX.PosY.Switch.HeadRestraint.Down : Head restraint down switch engaged

Height
type: Class
subclass of: Observable signal
subclass of: Restriction
  on property: unit
  all values from: DimensionlessUnit
subclass of: Restriction
  on property: isObservedBy
  all values from: Head restraint sensor
definition: Signal.Cabin.Seat.RowX.PosY.HeadRestraint.Height : Height of head restraint. 0 = Bottommost. 100 = Topmost.

Head restraint sensor
type: Class
subclass of: vehicle sensor
definition: Sensor measuring the position of the head restraint

Up
type: Class
subclass of: Actuable signal
subclass of: Restriction
  on property: Actuable signal
  all values from: Head restraint actuator
definition: Signal.Cabin.Seat.RowX.PosY.Switch.HeadRestraint.Up : Head restraint up switch engaged

High beam light
type: Class
subclass of: Actuator
definition: Turns on and off the high beam light

High Beam Light Switch
type: Class
subclass of: vehicle sensor
definition: Senses if the high beam switch is on

IsOpen
type: Class
subclass of: Actuable signal
subclass of: Observable signal
subclass of: Restriction
  on property: unit
  all values from: DimensionlessUnit
subclass of: Restriction
  on property: isActuatedBy
  all values from: Hood latch
subclass of: Restriction
  on property: isObservedBy
  all values from: Hood latch
definition: Signal.Body.Hood.IsOpen : hood open or closed. True = Open. False = Closed

Hood latch
type: Class
subclass of: Actuator
subclass of: vehicle sensor
definition: System controling the hood

IsActive
type: Class
subclass of: Actuable signal
subclass of: Observable signal
subclass of: Restriction
  on property: unit
  all values from: DimensionlessUnit
subclass of: Restriction
  on property: isActuatedBy
  all values from: Horn system
subclass of: Restriction
  on property: isObservedBy
  all values from: Horn system
definition: Signal.Body.Horn.IsActive : Horn active or inactive. True = Active. False = Inactive.

Horn system
type: Class
subclass of: Actuator
subclass of: vehicle sensor
definition: Horn/honk system

HybridBatteryRemaining
type: Class
subclass of: Observable signal
subclass of: Restriction
  on property: unit
  all values from: DimensionlessUnit
subclass of: Restriction
  on property: isObservedBy
  all values from: battery sensor
definition: Signal.OBD.HybridBatteryRemaining : PID 5B - Remaining life of hybrid battery

Increase
type: Class
subclass of: Actuable signal
subclass of: Restriction
  on property: Actuable signal
  all values from: Massage system
definition: Signal.Cabin.Seat.RowX.PosY.Switch.Massage.Increase : Increase massage level switch engaged

Inflate
type: Class
subclass of: Actuable signal
subclass of: Restriction
  on property: Actuable signal
  all values from: Lumber pressure actuator
definition: Signal.Cabin.Seat.RowX.PosY.Switch.SideBolster.Inflate : Lumbar inflation switch engaged

InstantConsumption
type: Class
subclass of: Observable signal
subclass of: Restriction
  on property: unit
  all values from: VolumePerDistanceUnit
subclass of: Restriction
  on property: isObservedBy
  all values from: Flow sensor
definition: Signal.Drivetrain.FuelSystem.InstantConsumption : Current consumption in liters per 100 km.

intake air temperature sensor
type: Class
subclass of: vehicle sensor

Intake Temperature
type: Class
subclass of: Observable signal
subclass of: Restriction
  on property: unit
  all values from: TemperatureUnit
subclass of: Restriction
  on property: isObservedBy
  all values from: intake air temperature sensor
definition: Signal.OBD.IntakeTemp : PID 0F - Intake temperature

IsAirConditioningActive
type: Class
subclass of: Observable signal
subclass of: Restriction
  on property: unit
  all values from: DimensionlessUnit
subclass of: Restriction
  on property: isActuatedBy
  all values from: Air conditioning system
subclass of: Restriction
  on property: isObservedBy
  all values from: Air conditioning system
definition: Signal.Cabin.HVAC.IsAirConditioningActive : Is Air conditioning active.

is backup light on
type: Class
subclass of: Actuable signal

IsBackupOn
type: Class
subclass of: Actuable signal
subclass of: Observable signal
subclass of: Restriction
  on property: unit
  all values from: DimensionlessUnit
subclass of: Restriction
  on property: isActuatedBy
  all values from: Backup light
subclass of: Restriction
  on property: isObservedBy
  all values from: Backup light switch
definition: Signal.Body.Lights.IsBackupOn : Is backup (reverse) light on

IsBelted
type: Class
subclass of: Observable signal
subclass of: Restriction
  on property: unit
  all values from: DimensionlessUnit
subclass of: Restriction
  on property: isObservedBy
  all values from: Belt sensor
definition: Signal.Cabin.Seat.RowX.PosY.IsBelted : Is the belt engaged.

IsBrakeOn
type: Class
subclass of: Actuable signal
subclass of: Observable signal
subclass of: Restriction
  on property: unit
  all values from: DimensionlessUnit
subclass of: Restriction
  on property: isActuatedBy
  all values from: Brake light
subclass of: Restriction
  on property: isObservedBy
  all values from: Brake light switch
definition: Signal.Body.Lights.IsBrakeOn : Is brake light on

IsChildLockActive
type: Class
subclass of: Observable signal
subclass of: Restriction
  on property: unit
  all values from: DimensionlessUnit
subclass of: Restriction
  on property: isActuatedBy
  all values from: Child lock
subclass of: Restriction
  on property: isObservedBy
  all values from: Child lock
definition: Signal.Cabin.Door.RowX.Left/Right.IsChildLockActive : Is door child lock engaged. True = Engaged. False = Disengaged.

IsDomeOn
type: Class
subclass of: Actuable signal
subclass of: Observable signal
subclass of: Restriction
  on property: unit
  all values from: DimensionlessUnit
subclass of: Restriction
  on property: isActuatedBy
  all values from: Dome light
subclass of: Restriction
  on property: isObservedBy
  all values from: Dome light
definition: Signal.Cabin.Lights.IsDomeOn : Is central dome light light on

IsFrontDefrosterActive
type: Class
subclass of: Actuable signal
subclass of: Observable signal
subclass of: Restriction
  on property: unit
  all values from: DimensionlessUnit
subclass of: Restriction
  on property: isActuatedBy
  all values from: Defroster
subclass of: Restriction
  on property: isObservedBy
  all values from: Defroster
definition: Signal.Cabin.HVAC.IsFrontDefrosterActive : Is front defroster active.

IsFrontFogOn
type: Class
subclass of: Actuable signal
subclass of: Observable signal
subclass of: Restriction
  on property: unit
  all values from: DimensionlessUnit
subclass of: Restriction
  on property: isActuatedBy
  all values from: Front fog light
subclass of: Restriction
  on property: isObservedBy
  all values from: Front fog position switch
definition: Signal.Body.Lights.IsFrontFogOn : Is front fog light on

IsGloveBoxOn
type: Class
subclass of: Actuable signal
subclass of: Observable signal
subclass of: Restriction
  on property: unit
  all values from: DimensionlessUnit
subclass of: Restriction
  on property: isActuatedBy
  all values from: Glove box light
subclass of: Restriction
  on property: isObservedBy
  all values from: Glove box light
definition: Signal.Cabin.Lights.IsGloveBoxOn : Is glove box light on

IsHazardOn
type: Class
subclass of: Actuable signal
subclass of: Observable signal
subclass of: Restriction
  on property: unit
  all values from: DimensionlessUnit
subclass of: Restriction
  on property: isActuatedBy
  all values from: Hazard light
subclass of: Restriction
  on property: isObservedBy
  all values from: Hazard light switch
definition: Signal.Body.Lights.IsHazardOn : Are hazards on

IsHighBeamOn
type: Class
subclass of: Actuable signal
subclass of: Observable signal
subclass of: Restriction
  on property: unit
  all values from: DimensionlessUnit
subclass of: Restriction
  on property: isActuatedBy
  all values from: High beam light
subclass of: Restriction
  on property: isObservedBy
  all values from: High Beam Light Switch
definition: Signal.Body.Lights.IsHighBeamOn : Is high beam on

IsLeftIndicatorOn
type: Class
subclass of: Actuable signal
subclass of: Observable signal
subclass of: Restriction
  on property: unit
  all values from: DimensionlessUnit
subclass of: Restriction
  on property: isActuatedBy
  all values from: left indicator light
subclass of: Restriction
  on property: isObservedBy
  all values from: Left indicator switch
definition: Signal.Body.Lights.IsLeftIndicatorOn : Is left indicator flashing

IsLowBeamOn
type: Class
subclass of: Actuable signal
subclass of: Observable signal
subclass of: Restriction
  on property: unit
  all values from: DimensionlessUnit
subclass of: Restriction
  on property: isActuatedBy
  all values from: Low beam light
subclass of: Restriction
  on property: isObservedBy
  all values from: Low Beam Light Switch
definition: Signal.Body.Lights.IsLowBeamOn : Is low beam on

IsParkingOn
type: Class
subclass of: Actuable signal
subclass of: Observable signal
subclass of: Restriction
  on property: unit
  all values from: DimensionlessUnit
subclass of: Restriction
  on property: isActuatedBy
  all values from: Parking light
subclass of: Restriction
  on property: isObservedBy
  all values from: Parking light switch
definition: Signal.Body.Lights.IsParkingOn : Is parking light on

IsPassengerOn
type: Class
subclass of: Actuable signal
subclass of: Observable signal
subclass of: Restriction
  on property: unit
  all values from: DimensionlessUnit
subclass of: Restriction
  on property: isActuatedBy
  all values from: Passenger light
subclass of: Restriction
  on property: isObservedBy
  all values from: Passenger light
definition: Signal.Cabin.Lights.RowX.Left/Right.IsPassengerOn : Is passenger light on

IsRearDefrosterActive
type: Class
subclass of: Actuable signal
subclass of: Observable signal
subclass of: Restriction
  on property: unit
  all values from: DimensionlessUnit
subclass of: Restriction
  on property: isActuatedBy
  all values from: Defroster
subclass of: Restriction
  on property: isObservedBy
  all values from: Defroster
definition: Signal.Cabin.HVAC.IsRearDefrosterActive : Is rear defroster active.

IsRearFogOn
type: Class
subclass of: Actuable signal
subclass of: Observable signal
subclass of: Restriction
  on property: unit
  all values from: DimensionlessUnit
subclass of: Restriction
  on property: isActuatedBy
  all values from: Rear fog light
subclass of: Restriction
  on property: isObservedBy
  all values from: Rear for light switch
definition: Signal.Body.Lights.IsRearFogOn : Is rear fog light on

IsRecirculationActive
type: Class
subclass of: Actuable signal
subclass of: Observable signal
subclass of: Restriction
  on property: unit
  all values from: DimensionlessUnit
subclass of: Restriction
  on property: isActuatedBy
  all values from: Recirculation system
subclass of: Restriction
  on property: isObservedBy
  all values from: Recirculation system
definition: Signal.Cabin.HVAC.IsRecirculationActive : Is recirculation active.

IsRightIndicatorOn
type: Class
subclass of: Actuable signal
subclass of: Observable signal
subclass of: Restriction
  on property: unit
  all values from: DimensionlessUnit
subclass of: Restriction
  on property: isActuatedBy
  all values from: right indicator light
subclass of: Restriction
  on property: isObservedBy
  all values from: Right indicator switch
definition: Signal.Body.Lights.IsRightIndicatorOn : Is right indicator flashing

IsRunningOn
type: Class
subclass of: Actuable signal
subclass of: Observable signal
subclass of: Restriction
  on property: isActuatedBy
  all values from: Running light
subclass of: Restriction
  on property: isObservedBy
  all values from: Running light switch
definition: Signal.Body.Lights.IsRunningOn : Are running lights on

IsSharedOn
type: Class
subclass of: Observable signal
subclass of: Restriction
  on property: unit
  all values from: DimensionlessUnit
subclass of: Restriction
  on property: isObservedBy
  all values from: Light sensor
definition: Signal.Cabin.Lights.RowX.IsSharedOn : Is light shared across first row on

IsTrunkOn
type: Class
subclass of: Actuable signal
subclass of: Observable signal
subclass of: Restriction
  on property: unit
  all values from: DimensionlessUnit
subclass of: Restriction
  on property: isActuatedBy
  all values from: Trunk light
subclass of: Restriction
  on property: isObservedBy
  all values from: Trunk light
definition: Signal.Cabin.Lights.IsTrunkOn : Is trunk light light on

Error
type: Class
subclass of: Observable signal
subclass of: Restriction
  on property: unit
  all values from: DimensionlessUnit
subclass of: Restriction
  on property: isObservedBy
  all values from: Lane departure detection sensor
definition: Signal.ADAS.LaneDepartureDetection.Error : Indicates if lane departure system incurred an error condition. True = Error. False = No Error.

IsActive
type: Class
subclass of: Actuable signal
subclass of: Observable signal
subclass of: Restriction
  on property: unit
  all values from: DimensionlessUnit
subclass of: Restriction
  on property: isActuatedBy
  all values from: Lane departure detection sensor
subclass of: Restriction
  on property: isObservedBy
  all values from: Lane departure detection sensor
definition: Signal.ADAS.LaneDepartureDetection.IsActive : Indicates if lane departure detection system is enabled. True = Enabled. False = Disabled.

Lane departure detection sensor
type: Class
subclass of: Actuator
subclass of: vehicle sensor
definition: Sensor measuring when a lane is crossed

Warning
type: Class
subclass of: Observable signal
subclass of: Restriction
  on property: unit
  all values from: DimensionlessUnit
subclass of: Restriction
  on property: isObservedBy
  all values from: Lane departure detection sensor
definition: Signal.ADAS.LaneDepartureDetection.Warning : Indicates if lane departure detection registered a lane departure

Lateral
type: Class
subclass of: Observable signal
subclass of: Restriction
  on property: unit
  all values from: LinearAccelerationUnit
subclass of: Restriction
  on property: isObservedBy
  all values from: Accelerometer
definition: Signal.Vehicle.Acceleration.Lateral : Vehicle acceleration in Y (lateral acceleration).

Latitude
type: Class
subclass of: Observable signal
subclass of: Restriction
  on property: unit
  all values from: AngleUnit
subclass of: Restriction
  on property: isObservedBy
  all values from: Global positioning system
definition: Signal.Cabin.Infotainment.Navigation.CurrentLocation.Latitude : Current latitude of vehicle, as reported by GPS.

Left indicator light
type: Class
subclass of: Actuator
definition: Turns on and off the left indicator

left indicator light
type: Class
subclass of: Actuable signal

Left indicator switch
type: Class
subclass of: vehicle sensor
definition: Senses if the left indicator switch is on

lidar
type: Class
subclass of: Sensor

LightIntensity
type: Class
subclass of: Observable signal
subclass of: Restriction
  on property: unit
  all values from: DimensionlessUnit
subclass of: Restriction
  on property: isObservedBy
  all values from: Light sensor
definition: Signal.Cabin.Lights.LightIntensity : Intensity of the interior lights. 0 = Off. 100 = Full brightness.

Light sensor
type: Class
subclass of: vehicle sensor
definition: Sensor measuring the light intensity

Temperature
type: Class
subclass of: Actuable signal
subclass of: Observable signal
subclass of: Restriction
  on property: unit
  all values from: TemperatureUnit
subclass of: Restriction
  on property: isActuatedBy
  all values from: Temperature switch
subclass of: Restriction
  on property: isObservedBy
  all values from: Thermometer
definition: Signal.Cabin.HVAC.RowX.Left/Right.Temperature : Temperature

LongTermFuelTrim1
type: Class
subclass of: Observable signal
subclass of: Restriction
  on property: unit
  all values from: DimensionlessUnit
definition: Signal.OBD.LongTermFuelTrim1 : PID 07/09 - Long Term (learned) Fuel Trim - Bank 1 - negative percent leaner, positive percent richer

LongTermO2Trim
type: Class
subclass of: Observable signal
subclass of: Restriction
  on property: unit
  all values from: DimensionlessUnit
subclass of: Restriction
  on property: isObservedBy
  all values from: diagnostic system
definition: Signal.OBD.LongTermO2Trim : PID 56/58 - Long term secondary O2 trim

Longitude
type: Class
subclass of: Observable signal
subclass of: Restriction
  on property: unit
  all values from: AngleUnit
subclass of: Restriction
  on property: isObservedBy
  all values from: Global positioning system
definition: Signal.Cabin.Infotainment.Navigation.CurrentLocation.Longitude : Current longitude of vehicle, as reported by GPS.

Longitudinal
type: Class
subclass of: Observable signal
subclass of: Restriction
  on property: unit
  all values from: LinearAccelerationUnit
subclass of: Restriction
  on property: isObservedBy
  all values from: Accelerometer
definition: Signal.Vehicle.Acceleration.Longitudinal : Vehicle acceleration in X (longitudinal acceleration).

Low beam light
type: Class
subclass of: Actuator
definition: Turns on and off the low beam light

Low Beam Light Switch
type: Class
subclass of: vehicle sensor
definition: Senses if the low beam light switch is on

Deflate
type: Class
subclass of: Actuable signal
subclass of: Restriction
  on property: Actuable signal
  all values from: Lumber pressure actuator
definition: Signal.Cabin.Seat.RowX.PosY.Switch.Lumbar.Deflate : Lumbar deflation switch engaged

Down
type: Class
subclass of: Actuable signal
subclass of: Restriction
  on property: Actuable signal
  all values from: Seat position actuator
definition: Signal.Cabin.Seat.RowX.PosY.Switch.Down : Seat down switch engaged

Height
type: Class
subclass of: Observable signal
subclass of: Restriction
  on property: unit
  all values from: DimensionlessUnit
subclass of: Restriction
  on property: isObservedBy
  all values from: Lumbar position sensor
definition: Signal.Cabin.Seat.RowX.PosY.Lumbar.Height : Lumbar support position. 0 = Lowermost. 100 = Uppermost.

Inflate
type: Class
subclass of: Actuable signal
subclass of: Restriction
  on property: Actuable signal
  all values from: Lumber pressure actuator
definition: Signal.Cabin.Seat.RowX.PosY.Switch.Lumbar.Inflate : Lumbar inflation switch engaged

Inflation
type: Class
subclass of: Observable signal
subclass of: Restriction
  on property: unit
  all values from: DimensionlessUnit
subclass of: Restriction
  on property: isObservedBy
  all values from: Lumbar position sensor
definition: Signal.Cabin.Seat.RowX.PosY.Lumbar.Inflation : Lumbar support inflation. 0 = Fully deflated. 100 = Fully inflated.

Lumbar position actuator
type: Class
subclass of: Actuator
definition: Controls the lumbar position

Lumbar position sensor
type: Class
subclass of: vehicle sensor
definition: Sensor measuring the lumbar position

Lumber pressure actuator
type: Class
subclass of: Actuator
definition: Controls the lumbar pressure

lumbar pressure sensor
type: Class
subclass of: vehicle sensor

Up
type: Class
subclass of: Actuable signal
subclass of: Restriction
  on property: Actuable signal
  all values from: Lumbar position actuator
definition: Signal.Cabin.Seat.RowX.PosY.Switch.Lumbar.Up : Lumbar up switch engaged

MAF
type: Class
subclass of: Observable signal
subclass of: Restriction
  on property: unit
  all values from: MassPerTimeUnit
subclass of: Restriction
  on property: isObservedBy
  all values from: Mass air flow sensor
definition: Signal.Drivetrain.InternalCombustionEngine.Engine.MAF / Signal.OBD.MAF / PID 10 : Grams of air drawn into engine per second.

MAF sensor
type: Class
subclass of: vehicle sensor

MAP
type: Class
subclass of: Observable signal
subclass of: Restriction
  on property: unit
  all values from: PressureOrStressUnit
subclass of: Restriction
  on property: isObservedBy
  all values from: Manifold Air Pressure Sensor
definition: Signal.Drivetrain.InternalCombustionEngine.Engine.MAP / Signal.OBD.MAP : PID 0B : Manifold air pressure possibly boosted using forced induction.

MIL
type: Class
subclass of: Observable signal
subclass of: Restriction
  on property: unit
  all values from: DimensionlessUnit
subclass of: Restriction
  on property: isObservedBy
  all values from: diagnostic system
definition: Signal.OBD.Status.MIL : Malfunction Indicator Light (MIL) False = Off, True = On

Manifold Air Pressure Sensor
type: Class
subclass of: vehicle sensor
definition: Sensor measuring the MAP (manifold air pressure)

Mass air flow sensor
type: Class
subclass of: vehicle sensor
definition: Sensor measuring the MAF (mass air flow)

Massage system
type: Class
subclass of: Actuator
subclass of: vehicle sensor
definition: Massage system for car seats

MaxMAF
type: Class
subclass of: Observable signal
subclass of: Restriction
  on property: unit
  all values from: MassPerTimeUnit
subclass of: Restriction
  on property: isObservedBy
  all values from: MAF sensor
definition: Signal.OBD.MaxMAF : PID 50 - Maximum flow for mass air flow sensor

Action
type: Class
subclass of: Actuable signal
subclass of: Observable signal
subclass of: Restriction
  on property: unit
  all values from: DimensionlessUnit
subclass of: Restriction
  on property: isActuatedBy
  all values from: Multimedia system
subclass of: Restriction
  on property: isObservedBy
  all values from: Multimedia system
definition: Signal.Cabin.Infotainment.Media.Action : Tells if the media was

Album
type: Class
subclass of: Observable signal
subclass of: Restriction
  on property: unit
  all values from: DimensionlessUnit
subclass of: Restriction
  on property: isObservedBy
  all values from: Multimedia system
definition: Signal.Cabin.Infotainment.Media.Played.Album : Name of album being played

Artist
type: Class
subclass of: Observable signal
subclass of: Restriction
  on property: unit
  all values from: DimensionlessUnit
subclass of: Restriction
  on property: isObservedBy
  all values from: Multimedia system
definition: Signal.Cabin.Infotainment.Media.Played.Artist : Name of artist being played

Source
type: Class
subclass of: Actuable signal
subclass of: Observable signal
subclass of: Restriction
  on property: unit
  all values from: DimensionlessUnit
subclass of: Restriction
  on property: isActuatedBy
  all values from: Multimedia system
subclass of: Restriction
  on property: isObservedBy
  all values from: Multimedia system
definition: Signal.Cabin.Infotainment.Media.Played.Source : Media selected for playback

Track
type: Class
subclass of: Observable signal
subclass of: Restriction
  on property: unit
  all values from: DimensionlessUnit
subclass of: Restriction
  on property: isObservedBy
  all values from: Multimedia system
definition: Signal.Cabin.Infotainment.Media.Played.Track : Name of track being played

URI
type: Class
subclass of: Observable signal
subclass of: Restriction
  on property: unit
  all values from: anyURI
subclass of: Restriction
  on property: isObservedBy
  all values from: Multimedia system
definition: Signal.Cabin.Infotainment.Media.Played.URI : User Resource associated with the media

Volume
type: Class
subclass of: Actuable signal
subclass of: Observable signal
subclass of: Restriction
  on property: unit
  all values from: DimensionlessUnit
subclass of: Restriction
  on property: isActuatedBy
  all values from: Multimedia system
subclass of: Restriction
  on property: isObservedBy
  all values from: Multimedia system
definition: Signal.Cabin.Infotainment.Media.Volume : Current Media Volume

Status
type: Class
subclass of: Actuable signal
subclass of: Observable signal
subclass of: Restriction
  on property: unit
  all values from: DimensionlessUnit
subclass of: Restriction
  on property: isActuatedBy
  all values from: Mirror heater
subclass of: Restriction
  on property: isObservedBy
  all values from: Mirror heater
definition: Signal.Body.Mirrors.Left/Right.Heating.Status : Mirror Heater on or off. True = Heater On. False = Heater Off.

Pan
type: Class
subclass of: Actuable signal
subclass of: Observable signal
subclass of: Restriction
  on property: unit
  all values from: DimensionlessUnit
subclass of: Restriction
  on property: isActuatedBy
  all values from: Mirror pan actuator
subclass of: Restriction
  on property: isObservedBy
  all values from: Mirror Pan Sensor
definition: Signal.Body.Mirrors.Left/Right.Pan : Mirror pan as a percent. 0 = Center Position. 100 = Fully Left Position. -100 = Fully Right Position.

Mirror pan actuator
type: Class
subclass of: Actuator
definition: Controls a mirro pan

Mirror Pan Sensor
type: Class
subclass of: vehicle sensor
definition: Sensor measuring the pan of a mirror

Tilt
type: Class
subclass of: Actuable signal
subclass of: Observable signal
subclass of: Restriction
  on property: unit
  all values from: DimensionlessUnit
subclass of: Restriction
  on property: isActuatedBy
  all values from: Mirror tilt actuator
subclass of: Restriction
  on property: isObservedBy
  all values from: Mirro Tilt Sensor
definition: Signal.Body.Mirrors.Left/Right.Tilt : Mirror tilt as a percent. 0 = Center Position. 100 = Fully Upward Position. -100 = Fully Downward Position.

Mirror tilt actuator
type: Class
subclass of: Actuator
definition: Controls a mirro tilt

Mirro Tilt Sensor
type: Class
subclass of: vehicle sensor
definition: Sensor measuring the tilt of a mirror

Mirror heater
type: Class
subclass of: Actuator
subclass of: vehicle sensor
definition: Mirror heating appliance

Multimedia system
type: Class
subclass of: Actuator
subclass of: vehicle sensor
definition: Multimedia system

Current
type: Class
subclass of: Observable signal
subclass of: Restriction
  on property: unit
  all values from: ElectricCurrentUnit
definition: Signal.OBD.O2WR.Sensor1.Current : PID 34-3B - Lambda current for wide range/band oxygen sensor 1

Voltage
type: Class
subclass of: Observable signal
subclass of: Restriction
  on property: unit
  all values from: EnergyPerElectricChargeUnit
definition: Signal.OBD.O2.BankX.SensorY.Voltage : PID 14->1B - Sensor voltage

Voltage
type: Class
subclass of: Observable signal
subclass of: Restriction
  on property: unit
  all values from: EnergyPerElectricChargeUnit
definition: Signal.OBD.O2WR.SensorX.Voltage : PID 24->2B - Lambda voltage for wide range/band oxygen sensor X

Observable signal
type: Class
definition: All observable signals that can dynamically be updated by the vehicle

Error
type: Class
subclass of: Observable signal
subclass of: Restriction
  on property: unit
  all values from: DimensionlessUnit
subclass of: Restriction
  on property: isObservedBy
  all values from: Obstacle detection Sensor
definition: Signal.ADAS.ObstacleDetection.Error : Indicates if obstacle sensor system incurred an error condition. True = Error. False = No Error.

IsActive
type: Class
subclass of: Actuable signal
subclass of: Observable signal
subclass of: Restriction
  on property: unit
  all values from: DimensionlessUnit
subclass of: Restriction
  on property: isActuatedBy
  all values from: Obstacle detection Sensor
subclass of: Restriction
  on property: isObservedBy
  all values from: Obstacle detection Sensor
definition: Signal.ADAS.ObstacleDetection.IsActive : Indicates if obstacle sensor system is enabled. Tue = Enabled. False = Disabled.

Obstacle detection Sensor
type: Class
subclass of: Actuator
subclass of: vehicle sensor
definition: Sensor measuring the distance to obstacles

Occupant classification system
type: Class
subclass of: vehicle sensor
definition: Sensor detecting the presence of a passenger in a seat

Odometer
type: Class
subclass of: vehicle sensor
definition: Sensor measuring the travelled distance

Oil pressure sensor
type: Class
subclass of: vehicle sensor
definition: Sensor measuring the pressure of oil in the engine

Oil thermometer
type: Class
subclass of: vehicle sensor
definition: Sensor measuring the oil temperature

PadWear
type: Class
subclass of: Observable signal
subclass of: Restriction
  on property: unit
  all values from: DimensionlessUnit
subclass of: Restriction
  on property: isObservedBy
  all values from: Brake padwear sensor
definition: Signal.Chassis.Axle.RowX.Wheel.Left/Right.Brake.PadWear : Brake pad wear as percent. 0 = No Wear. 100 = Worn.

IsEngaged
type: Class
subclass of: Actuable signal
subclass of: Observable signal
subclass of: Restriction
  on property: unit
  all values from: DimensionlessUnit
subclass of: Restriction
  on property: isObservedBy
  all values from: Parking brake sensor
subclass of: Restriction
  on property: isActuatedBy
  all values from: Parking brake switch
definition: Signal.Chassis.ParkingBrake.IsEngaged : Parking brake status. True = Parking Brake is Engaged. False = Parking Brake is not Engaged.

Parking brake sensor
type: Class
subclass of: vehicle sensor
definition: Sensor measuring if the parking brake is engaged

Parking brake switch
type: Class
subclass of: Actuator
definition: Controls the parking brake

Parking light
type: Class
subclass of: Actuator
definition: Turns on and off the parking light

Parking light switch
type: Class
subclass of: vehicle sensor
definition: Senses if the parking lkight switch is on

Passenger light
type: Class
subclass of: Actuator
subclass of: vehicle sensor
definition: Individual passenger light system

Pedal position sensor
type: Class
subclass of: vehicle sensor
definition: Sensor measuring the pedal position

PerformanceMode
type: Class
subclass of: Actuable signal
subclass of: Observable signal
subclass of: Restriction
  on property: unit
  all values from: DimensionlessUnit
subclass of: Restriction
  on property: isActuatedBy
  all values from: Drive system
subclass of: Restriction
  on property: isObservedBy
  all values from: Drive system
definition: Signal.Drivetrain.Transmission.PerformanceMode : Current gearbox performance mode.

PidsA
type: Class
subclass of: Observable signal
subclass of: Restriction
  on property: unit
  all values from: DimensionlessUnit
subclass of: Restriction
  on property: isObservedBy
  all values from: diagnostic system
definition: Signal.OBD.PidsA : PID 00 - Bit array of the supported pids 01 to 20

PidsB
type: Class
subclass of: Observable signal
subclass of: Restriction
  on property: unit
  all values from: DimensionlessUnit
subclass of: Restriction
  on property: isObservedBy
  all values from: diagnostic system
definition: Signal.OBD.PidsB : PID 20 - Bit array of the supported pids 21 to 40

PidsC
type: Class
subclass of: Observable signal
subclass of: Restriction
  on property: unit
  all values from: DimensionlessUnit
subclass of: Restriction
  on property: isObservedBy
  all values from: diagnostic system
definition: Signal.OBD.PidsC : PID 40 - Bit array of the supported pids 41 to 60

Power meter
type: Class
subclass of: vehicle sensor
definition: Sensor measuring the engine power

Intensity
type: Class
subclass of: Observable signal
subclass of: Restriction
  on property: unit
  all values from: DimensionlessUnit
subclass of: Restriction
  on property: isObservedBy
  all values from: Rain sensor
definition: Signal.Body.Raindetection.Intensity : Rain intensity. 0 = Dry, No Rain. 100 = Covered.

Rain sensor
type: Class
subclass of: vehicle sensor
definition: Sensor measuring the rain intensity

Range
type: Class
subclass of: Observable signal
subclass of: Restriction
  on property: unit
  all values from: LengthUnit
subclass of: Restriction
  on property: isObservedBy
  all values from: Fuel tank level sensor
definition: Signal.Drivetrain.FuelSystem.Range : Range in meters.

Rear fog light
type: Class
subclass of: Actuator
definition: Turns on and off the rear fog light

Rear for light switch
type: Class
subclass of: vehicle sensor
definition: Senses if the rear fog light switch is on

Rear shade actuator
type: Class
subclass of: Actuator
definition: Controls a window blind

Position
type: Class
subclass of: Actuable signal
subclass of: Restriction
  on property: Actuable signal
  all values from: Rear shade actuator
definition: Signal.Cabin.RearShade.Position : Position of side window blind. 0 = Fully retracted. 100 = Fully deployed.

Switch
type: Class
subclass of: Actuable signal
subclass of: Restriction
  on property: Actuable signal
  all values from: Rear shade system
definition: Signal.Cabin.RearShade.Switch : Switch controlling sliding action such as window, sunroof, or blind.

Rear shade system
type: Class
subclass of: Actuator
definition: Controls sliding actions

DimmingLevel
type: Class
subclass of: Actuable signal
subclass of: Observable signal
subclass of: Restriction
  on property: unit
  all values from: DimensionlessUnit
subclass of: Restriction
  on property: isActuatedBy
  all values from: Dimming system
subclass of: Restriction
  on property: isObservedBy
  all values from: Dimming system
definition: Signal.Cabin.RearviewMirror.DimmingLevel : Dimming level of rearview mirror. 0 = undimmed. 100 = fully dimmed

Recirculation system
type: Class
subclass of: Actuator
subclass of: vehicle sensor
definition: Recirculation system

Backward
type: Class
subclass of: Actuable signal
subclass of: Restriction
  on property: Actuable signal
  all values from: Seat position actuator
definition: Signal.Cabin.Seat.RowX.PosY.Switch.Recline.Backward : Seatback recline backward switch engaged

Forward
type: Class
subclass of: Actuable signal
subclass of: Restriction
  on property: Actuable signal
  all values from: Seat position actuator
definition: Signal.Cabin.Seat.RowX.PosY.Switch.Recline.Forward : Seatback recline forward switch engaged

RelativeAcceleratorPosition
type: Class
subclass of: Observable signal
subclass of: Restriction
  on property: unit
  all values from: DimensionlessUnit
subclass of: Restriction
  on property: isObservedBy
  all values from: Pedal position sensor
definition: Signal.OBD.RelativeAcceleratorPosition : PID 5A - Relative accelerator pedal position

RelativeThrottlePosition
type: Class
subclass of: Observable signal
subclass of: Restriction
  on property: unit
  all values from: DimensionlessUnit
subclass of: Restriction
  on property: isObservedBy
  all values from: Throttle position
definition: Signal.OBD.RelativeThrottlePosition : PID 45 - Relative throttle position

Right indicator light
type: Class
subclass of: Actuator
definition: Turns on and off the right indicator

right indicator light
type: Class
subclass of: Actuable signal

Right indicator switch
type: Class
subclass of: vehicle sensor
definition: Senses if the right indicator switch is on

Speed
type: Class
subclass of: Observable signal
subclass of: Restriction
  on property: unit
  all values from: AngularVelocityUnit
subclass of: Restriction
  on property: isObservedBy
  all values from: Rotational speed sensor
definition: Signal.Drivetrain.InternalCombustionEngine.Engine.Speed / Signal.OBD.EngineSpeed : PID 0C : Engine speed measured as rotations per minute.

Rotational speed sensor
type: Class
subclass of: vehicle sensor
definition: Sensor measuring the rotational speed

RunTime
type: Class
subclass of: Observable signal
subclass of: Restriction
  on property: unit
  all values from: TimeUnit
subclass of: Restriction
  on property: isObservedBy
  all values from: Timer
definition: Signal.OBD.RunTime : PID 1F - Engine run time

RunTimeMIL
type: Class
subclass of: Observable signal
subclass of: Restriction
  on property: unit
  all values from: TimeUnit
subclass of: Restriction
  on property: isObservedBy
  all values from: Timer
definition: Signal.OBD.RunTimeMIL : PID 4D - Run time with MIL on

Running light
type: Class
subclass of: Actuator
definition: Turns on and off the running light

Running light switch
type: Class
subclass of: vehicle sensor
definition: Senses if the running light switch is on

Backward
type: Class
subclass of: Actuable signal
subclass of: Restriction
  on property: Actuable signal
  all values from: Seat position actuator
definition: Signal.Cabin.Seat.RowX.PosY.Switch.Backward : Seat forward switch engaged

Seat cooler
type: Class
subclass of: Actuator
definition: Controls the seat cooler and heater

Cooler
type: Class
subclass of: Actuable signal
subclass of: Restriction
  on property: Actuable signal
  all values from: Seat cooler
definition: Signal.Cabin.Seat.RowX.PosY.Switch.Cooler : Cooler switch for Seat heater

Down
type: Class
subclass of: Actuable signal
subclass of: Restriction
  on property: Actuable signal
  all values from: Lumbar position actuator
definition: Signal.Cabin.Seat.RowX.PosY.Switch.Lumbar.Down : Lumbar down switch engaged

Forward
type: Class
subclass of: Actuable signal
subclass of: Restriction
  on property: Actuable signal
  all values from: Seat position actuator
definition: Signal.Cabin.Seat.RowX.PosY.Switch.Forward : Seat forward switch engaged

HasPassenger
type: Class
subclass of: Observable signal
subclass of: Restriction
  on property: unit
  all values from: DimensionlessUnit
subclass of: Restriction
  on property: isObservedBy
  all values from: Occupant classification system
definition: Signal.Cabin.Seat.RowX.PosY.HasPassenger : Does the seat have a passenger in it.

seat heater
type: Class
subclass of: vehicle sensor
definition: Sensor measuring the

Heating
type: Class
subclass of: Observable signal
subclass of: Restriction
  on property: unit
  all values from: DimensionlessUnit
subclass of: Restriction
  on property: isObservedBy
  all values from: seat heater
definition: Signal.Cabin.Seat.RowX.PosY.Heating : Seat cooling / heating. 0 = off. -100 = max cold. +100 = max heat

Massage
type: Class
subclass of: Observable signal
subclass of: Restriction
  on property: unit
  all values from: DimensionlessUnit
subclass of: Restriction
  on property: isObservedBy
  all values from: Massage system
definition: Signal.Cabin.Seat.RowX.PosY.Massage : Seat massage level. 0 = off. 100 = max massage.

Position
type: Class
subclass of: Observable signal
subclass of: Restriction
  on property: unit
  all values from: DimensionlessUnit
subclass of: Restriction
  on property: isObservedBy
  all values from: Seat position sensor
definition: Signal.Cabin.Seat.RowX.PosY.Position : Seat horizontal position. 0 = Frontmost. 100 = Rearmost

Seat position actuator
type: Class
subclass of: Actuator
definition: Controls the seat position

Seat position sensor
type: Class
subclass of: vehicle sensor
definition: Sensor measuring the position of the seat

Recline
type: Class
subclass of: Observable signal
subclass of: Restriction
  on property: unit
  all values from: AngleUnit
subclass of: Restriction
  on property: isObservedBy
  all values from: Seat position sensor
definition: Signal.Cabin.Seat.RowX.PosY.Recline : Recline level. -90 = Max forward recline. 90 max backward recline

Up
type: Class
subclass of: Actuable signal
subclass of: Restriction
  on property: Actuable signal
  all values from: Seat position actuator
definition: Signal.Cabin.Seat.RowX.PosY.Switch.Up : Seat up switch engaged

Warmer
type: Class
subclass of: Actuable signal
subclass of: Restriction
  on property: Actuable signal
  all values from: seat heater
definition: Signal.Cabin.Seat.RowX.PosY.Switch.Warmer : Warmer switch for Seat heater

SelectedURI
type: Class
subclass of: Actuable signal
subclass of: Observable signal
subclass of: Restriction
  on property: unit
  all values from: anyURI
subclass of: Restriction
  on property: isActuatedBy
  all values from: Multimedia system
subclass of: Restriction
  on property: isObservedBy
  all values from: Multimedia system
definition: Signal.Cabin.Infotainment.Media.SelectedURI : URI of suggested media that was selected

ShortTermFuelTrim1
type: Class
subclass of: Observable signal
subclass of: Restriction
  on property: unit
  all values from: DimensionlessUnit
definition: Signal.OBD.ShortTermFuelTrim1 : PID 06/08 - Short Term (immediate) Fuel Trim - Bank 1 - negative percent leaner, positive percent richer

ShortTermO2Trim
type: Class
subclass of: Observable signal
subclass of: Restriction
  on property: unit
  all values from: DimensionlessUnit
subclass of: Restriction
  on property: isObservedBy
  all values from: diagnostic system
definition: Signal.OBD.ShortTermO2Trim : PID 55/57 - Short term secondary O2 trim

Inflation
type: Class
subclass of: Observable signal
subclass of: Restriction
  on property: unit
  all values from: DimensionlessUnit
subclass of: Restriction
  on property: isObservedBy
  all values from: lumbar pressure sensor
definition: Signal.Cabin.Seat.RowX.PosY.SideBolster.Inflation : Lumbar support inflation. 0 = Fully deflated. 100 = Fully inflated.

sonar
type: Class
subclass of: Sensor

SpeedSet
type: Class
subclass of: Actuable signal
subclass of: Observable signal
subclass of: Restriction
  on property: unit
  all values from: LinearVelocityUnit
subclass of: Restriction
  on property: isActuatedBy
  all values from: Cruise control system
subclass of: Restriction
  on property: isObservedBy
  all values from: Cruise control system
definition: Signal.ADAS.CruiseControl.SpeedSet : Set cruise control speed in kilometers per hour

Speedometer
type: NamedIndividual
type: Class
subclass of: vehicle sensor
definition: Sensor measuring the speed, in a gearbox

Angle
type: Class
subclass of: Observable signal
subclass of: Restriction
  on property: unit
  all values from: AngleUnit
subclass of: Restriction
  on property: isObservedBy
  all values from: Steering wheel angle sensor
definition: Signal.Chassis.SteeringWheel.Angle : Steering wheel angle. Positive = degrees to the left. Negative = degrees to the right.

Steering wheel angle sensor
type: Class
subclass of: vehicle sensor
definition: Sensor measuring the angle of the steering wheel

Extension
type: Class
subclass of: Actuable signal
subclass of: Observable signal
subclass of: Restriction
  on property: unit
  all values from: DimensionlessUnit
subclass of: Restriction
  on property: isActuatedBy
  all values from: Steering wheel position actuator
subclass of: Restriction
  on property: isObservedBy
  all values from: Steering wheel position sensor
definition: Signal.Chassis.SteeringWheel.Extension : Steering wheel column extension from dashboard. 0 = Closest to dashboard. 100 = Furthest from dashboard.

Steering wheel position actuator
type: Class
subclass of: Actuator
definition: Controls the steering wheel position

Steering wheel position sensor
type: Class
subclass of: vehicle sensor
definition: Sensor measuring the position of a steering wheel

Tilt
type: Class
subclass of: Actuable signal
subclass of: Observable signal
subclass of: Restriction
  on property: unit
  all values from: DimensionlessUnit
subclass of: Restriction
  on property: isActuatedBy
  all values from: Steering wheel position actuator
subclass of: Restriction
  on property: isObservedBy
  all values from: Steering wheel position sensor
definition: Signal.Chassis.SteeringWheel.Tilt : Steering wheel column tilt. 0 = Lowest position. 100 = Highest position.

Position
type: Class
subclass of: Actuable signal
subclass of: Restriction
  on property: Actuable signal
  all values from: Rear shade actuator
definition: Signal.Cabin.Sunroof.Shade.Position : Position of side window blind. 0 = Fully retracted. 100 = Fully deployed.

Switch
type: Class
subclass of: Actuable signal
subclass of: Restriction
  on property: Actuable signal
  all values from: Rear shade system
definition: Signal.Cabin.Sunroof.Shade.Switch : Switch controlling sliding action such as window, sunroof, or blind.

Position
type: Class
subclass of: Observable signal
subclass of: Restriction
  on property: unit
  all values from: DimensionlessUnit
subclass of: Restriction
  on property: isObservedBy
  all values from: Sunroof position sensor
definition: Signal.Cabin.Sunroof.Position : Sunroof position. 0 = Fully closed 100 = Fully opened. -100 = Fully tilted

Sunroof position actuator
type: Class
subclass of: Actuator
definition: Controls the sunroof slide

Sunroof position sensor
type: Class
subclass of: vehicle sensor
definition: Sensor measuring the position of the sunroof

Switch
type: Class
subclass of: Actuable signal
subclass of: Restriction
  on property: Actuable signal
  all values from: Sunroof position actuator
definition: Signal.Cabin.Sunroof.Switch : Switch controlling sliding action such as window, sunroof, or shade.

Error
type: Class
subclass of: Observable signal
subclass of: Restriction
  on property: unit
  all values from: DimensionlessUnit
subclass of: Restriction
  on property: isObservedBy
  all values from: Traction control system
definition: Signal.ADAS.TCS.Error : Indicates if TCS incurred an error condition. True = Error. False = No Error.

IsActive
type: Class
subclass of: Actuable signal
subclass of: Observable signal
subclass of: Restriction
  on property: unit
  all values from: DimensionlessUnit
subclass of: Restriction
  on property: isActuatedBy
  all values from: Traction control system
subclass of: Restriction
  on property: isObservedBy
  all values from: Traction control system
definition: Signal.ADAS.TCS.IsActive : Indicates if TCS is enabled. Tue = Enabled. False = Disabled.

IsEngaged
type: Class
subclass of: Observable signal
subclass of: Restriction
  on property: unit
  all values from: DimensionlessUnit
subclass of: Restriction
  on property: isObservedBy
  all values from: Traction control system
definition: Signal.ADAS.TCS.IsEngaged : Indicates if TCS is currently regulating traction. True = Engaged. False = Not Engaged.

TPS
type: Class
subclass of: Observable signal
subclass of: Restriction
  on property: unit
  all values from: DimensionlessUnit
subclass of: Restriction
  on property: isObservedBy
  all values from: Throttle position
definition: Signal.Drivetrain.InternalCombustionEngine.Engine.TPS : Current throttle position.

Level
type: Class
subclass of: Observable signal
subclass of: Restriction
  on property: unit
  all values from: DimensionlessUnit
subclass of: Restriction
  on property: isObservedBy
  all values from: Fuel tank level sensor
definition: Signal.Drivetrain.FuelSystem.Level / Signal.OBD.FuelLevel / PID 2F: Level in fuel tank as percent of capacity. 0 = empty. 100 = full.

Temperature switch
type: Class
subclass of: Actuator
definition: Controls the local temperature in HVAC systems

Thermometer
type: Class
subclass of: vehicle sensor
definition: Sensor measuring the temperature

ThrottleActuator
type: Class
subclass of: Actuable signal
subclass of: Observable signal
subclass of: Restriction
  on property: unit
  all values from: DimensionlessUnit
subclass of: Restriction
  on property: isActuatedBy
  all values from: throttle actuator
subclass of: Restriction
  on property: isObservedBy
  all values from: Throttle position
definition: Signal.OBD.ThrottleActuator : PID 4C - Commanded throttle actuator

throttle actuator
type: Class
subclass of: Actuator

ThrottlePosition
type: Class
subclass of: Observable signal
subclass of: Restriction
  on property: unit
  all values from: DimensionlessUnit
subclass of: Restriction
  on property: isObservedBy
  all values from: Throttle position
definition: Signal.OBD.ThrottlePosition : PID 11 - Throttle position - 0 = closed throttle, 100 = open throttle

ThrottlePositionB
type: Class
subclass of: Observable signal
subclass of: Restriction
  on property: unit
  all values from: DimensionlessUnit
subclass of: Restriction
  on property: isObservedBy
  all values from: Throttle position
definition: Signal.OBD.ThrottlePositionB/C : PID 47/48 - Absolute throttle position B/C

Throttle position
type: Class
subclass of: vehicle sensor
definition: Sensor measuring the trottle position

TimeSinceDTCCleared
type: Class
subclass of: Observable signal
subclass of: Restriction
  on property: unit
  all values from: TimeUnit
subclass of: Restriction
  on property: isObservedBy
  all values from: Timer
definition: Signal.OBD.TimeSinceDTCCleared : PID 4E - Time since trouble codes cleared

TimeSinceStart
type: Class
subclass of: Observable signal
subclass of: Restriction
  on property: unit
  all values from: TimeUnit
subclass of: Restriction
  on property: isObservedBy
  all values from: Timer
definition: Signal.Drivetrain.FuelSystem.TimeSinceStart : Time elapsed since start in seconds.

Timer
type: Class
subclass of: vehicle sensor
definition: Sensor measuring the elapsed time

TimingAdvance
type: Class
subclass of: Observable signal
subclass of: Restriction
  on property: unit
  all values from: AngleUnit
subclass of: Restriction
  on property: isObservedBy
  all values from: diagnostic system
definition: Signal.OBD.TimingAdvance : PID 0E - Time advance (angle)

Pressure
type: Class
subclass of: Observable signal
subclass of: Restriction
  on property: unit
  all values from: PressureOrStressUnit
subclass of: Restriction
  on property: isObservedBy
  all values from: Tire pressure monitoring system
definition: Signal.Chassis.Axle.RowX.Wheel.Left/Right.Tire.Pressure : Tire pressure in kilo-Pascal

PressureLow
type: Class
subclass of: Observable signal
subclass of: Restriction
  on property: unit
  all values from: DimensionlessUnit
subclass of: Restriction
  on property: isObservedBy
  all values from: Tire pressure monitoring system
definition: Signal.Chassis.Axle.RowX.Wheel.Left/Right.Tire.PressureLow : Tire Pressure Status. True = Low tire pressure. False = Good tire pressure.

Tire pressure monitoring system
type: Class
subclass of: vehicle sensor
definition: Sensor measuring the pressure of a tire

Temperature
type: Class
subclass of: Observable signal
subclass of: Restriction
  on property: unit
  all values from: TemperatureUnit
subclass of: Restriction
  on property: isObservedBy
  all values from: Tire temperature sensor
definition: Signal.Chassis.Axle.RowX.Wheel.Left/Right.Tire.Temperature : Tire temperature in Celsius.

Tire temperature sensor
type: Class
subclass of: vehicle sensor
definition: Sensor measuring the temperature of a tire

Torque
type: Class
subclass of: Observable signal
subclass of: Restriction
  on property: unit
  all values from: BendingMomentOrTorqueUnit
subclass of: Restriction
  on property: isObservedBy
  all values from: Torquemeter
definition: Signal.Drivetrain.InternalCombustionEngine.Engine.Torque : Current engine torque.

Torquemeter
type: Class
subclass of: vehicle sensor
definition: Sensor measuring a torque

Traction control system
type: Class
subclass of: Actuator
subclass of: vehicle sensor
definition: Appliance designed to prevent loss of traction of wheels

TravelledDistance
type: Class
subclass of: Observable signal
subclass of: Restriction
  on property: unit
  all values from: LengthUnit
subclass of: Restriction
  on property: isObservedBy
  all values from: Odometer
definition: Signal.Drivetrain.Transmission.TravelledDistance : Odometer reading

IsLocked
type: Class
subclass of: Actuable signal
subclass of: Observable signal
subclass of: Restriction
  on property: unit
  all values from: DimensionlessUnit
subclass of: Restriction
  on property: isActuatedBy
  all values from: Trunk lock
subclass of: Restriction
  on property: isObservedBy
  all values from: Trunk lock
definition: Signal.Body.Trunk.IsLocked : Is trunk locked or unlocked. True = Locked. False = Unlocked.

IsOpen
type: Class
subclass of: Actuable signal
subclass of: Observable signal
subclass of: Restriction
  on property: unit
  all values from: DimensionlessUnit
subclass of: Restriction
  on property: isActuatedBy
  all values from: Trunk latch
subclass of: Restriction
  on property: isObservedBy
  all values from: Trunk latch
definition: Signal.Body.Trunk.IsOpen : Trunk open or closed. True = Open. False = Closed

Trunk latch
type: Class
subclass of: Actuator
subclass of: vehicle sensor
definition: System opening the trunk

Trunk light
type: Class
subclass of: Actuator
subclass of: vehicle sensor
definition: Trunk light

Trunk lock
type: Class
subclass of: Actuator
subclass of: vehicle sensor
definition: System locking the trunk

Pitch
type: Class
subclass of: Observable signal
subclass of: Restriction
  on property: unit
  all values from: AngularVelocityUnit
subclass of: Restriction
  on property: isObservedBy
  all values from: Gyroscope
definition: Signal.Vehicle.AngularVelocity.Pitch : Vehicle rotation rate along Y (lateral).

Roll
type: Class
subclass of: Observable signal
subclass of: Restriction
  on property: unit
  all values from: AngularVelocityUnit
subclass of: Restriction
  on property: isObservedBy
  all values from: Gyroscope
definition: Signal.Vehicle.AngularVelocity.Roll : Vehicle rotation rate along X (longitudinal).

vehicle sensor
type: Class
subclass of: vehicle part

Speed
type: Class
subclass of: Observable signal
subclass of: Restriction
  on property: unit
  all values from: LinearVelocityUnit
subclass of: Restriction
  on property: isObservedBy
  all values from: Class
    one of: Global positioning system
    one of: Speedometer
definition: Signal.Vehicle.Speed / Signal.Drivetrain.Transmission.Speed / Signal.Cabin.Infotainment.Navigation.CurrentLocation.Speed / Signal.OBD.Speed : PID 0D: Vehicle speed

Yaw
type: Class
subclass of: Observable signal
subclass of: Restriction
  on property: unit
  all values from: AngularVelocityUnit
subclass of: Restriction
  on property: isObservedBy
  all values from: Gyroscope
definition: Signal.Vehicle.AngularVelocity.Yaw : Vehicle rotation rate along Z (vertical).

Vertical
type: Class
subclass of: Observable signal
subclass of: Restriction
  on property: unit
  all values from: LinearAccelerationUnit
subclass of: Restriction
  on property: isObservedBy
  all values from: Accelerometer
definition: Signal.Vehicle.Acceleration.Vertical : Vehicle acceleration in Z (vertical acceleration).

voltage sensor
type: Class
subclass of: vehicle sensor

WarmupsSinceDTCClear
type: Class
subclass of: Observable signal
subclass of: Restriction
  on property: unit
  all values from: DimensionlessUnit
subclass of: Restriction
  on property: isObservedBy
  all values from: diagnostic system
definition: Signal.OBD.WarmupsSinceDTCClear : PID 30 - Number of warm-ups since codes cleared

Level
type: Class
subclass of: Observable signal
subclass of: Restriction
  on property: unit
  all values from: DimensionlessUnit
subclass of: Restriction
  on property: isObservedBy
  all values from: Washer fluid level sensor
definition: Signal.Body.Windshield.Front/Rear.WasherFluid.Level : Washer fluid level as a percent. 0 = Empty. 100 = Full.

LevelLow
type: Class
subclass of: Observable signal
subclass of: Restriction
  on property: unit
  all values from: DimensionlessUnit
subclass of: Restriction
  on property: isObservedBy
  all values from: Washer fluid level sensor
definition: Signal.Body.Windshield.Front/Rear.WasherFluid.LevelLow : Low level indication for washer fluid. True = Level Low. False = Level OK.

Washer fluid level sensor
type: Class
subclass of: vehicle sensor
definition: Sensor measuring the washer fluid level

Position
type: Class
subclass of: Observable signal
subclass of: Restriction
  on property: unit
  all values from: DimensionlessUnit
subclass of: Restriction
  on property: isObservedBy
  all values from: Window position sensor
definition: Signal.Cabin.Door.RowX.Left/Right.Window.Position : Window position. 0 = Fully closed 100 = Fully opened.

Window position sensor
type: Class
subclass of: vehicle sensor
definition: Sensor measuring the position of a window

Position
type: Class
subclass of: Actuable signal
subclass of: Restriction
  on property: isActuatedBy
  all values from: Rear shade actuator
definition: Signal.Cabin.Door.RowX.Left/Right.Shade.Position : Position of side window blind. 0 = Fully retracted. 100 = Fully deployed.

Switch
type: Class
subclass of: Actuable signal
subclass of: Restriction
  on property: Actuable signal
  all values from: Rear shade system
definition: Signal.Cabin.Door.RowX.Left/Right.Shade.Switch : Switch controlling sliding action such as window, sunroof, or blind.

Switch
type: Class
subclass of: Actuable signal
subclass of: Restriction
  on property: Actuable signal
  all values from: Rear shade system
definition: Signal.Cabin.Door.RowX.Left/Right.Window.Switch : Switch controlling sliding action such as window, sunroof, or blind.

Windshiel heater
type: Class
subclass of: Actuator
definition: Controls a windshield heater

Windshield heater switch
type: Class
subclass of: vehicle sensor
definition: Senses the windshield heater status

Status
type: Class
subclass of: Actuable signal
subclass of: Observable signal
subclass of: Restriction
  on property: unit
  all values from: DimensionlessUnit
subclass of: Restriction
  on property: isActuatedBy
  all values from: Windshiel heater
subclass of: Restriction
  on property: isObservedBy
  all values from: Windshield heater switch
definition: Signal.Body.Windshield.Front.Heating.Status : Front/Rear windshield heater status. 0 - off, 1 - on

Wiper
type: Class
subclass of: Actuator
definition: Controls a wiper

Wiper switch
type: Class
subclass of: vehicle sensor
definition: Senses the wiping level

Status
type: Class
subclass of: Actuable signal
subclass of: Observable signal
subclass of: Restriction
  on property: unit
  all values from: DimensionlessUnit
subclass of: Restriction
  on property: isActuatedBy
  all values from: Wiper
subclass of: Restriction
  on property: isObservedBy
  all values from: Wiper switch
definition: Signal.Body.Windshield.Front.Wiping.Status : Front wiper status

has signal
type: ObjectProperty
domain: vehicle part
definition: Property of having signals in a branch