Equities CFI Classification Individuals Ontology
type: Ontology
abstract: This ontology covers the ISO 10962, Fourth edition, 2019-10 classification codes for instruments that represent an ownership interest in an entity or pool of assets. It is intended to cover sections most of the codes included in section 6.2 of the standard, with the exception of structured instruments, section 6.2.8, which will be covered under derivatives.
contributor: Thematix Partners LLC
license: https://opensource.org/licenses/MIT
imports: Relations
imports: AnnotationVocabulary
imports: EquityInstruments
imports: SecuritiesClassification
imports: SecuritiesIssuance
imports: SecuritiesListings
imports: Classifiers
imports: Collections
version IRI: EquityCFIClassificationIndividuals
change note: The https://spec.edmcouncil.org/fibo/ontology/SEC/Equities/EquityCFIClassificationIndividuals.rdf version of the ontology was modified to use the Commons Ontology Library (Commons) Annotation Vocabulary rather than the OMG's Specification Metadata vocabulary.
change note: The https://spec.edmcouncil.org/fibo/ontology/SEC/Equities/EquityCFIClassificationIndividuals.rdf version of this ontology was modified to add a parent class of extendable preferred share where appropriate.
change note: The https://spec.edmcouncil.org/fibo/ontology/SEC/Equities/EquityCFIClassificationIndividuals.rdf version of this ontology was modified to use the Commons Ontology Library (Commons) rather than the OMG's Languages, Countries and Codes (LCC) and to eliminate redundancies in FIBO as appropriate.
change note: The https://spec.edmcouncil.org/fibo/ontology/SEC/Equities/EquityCFIClassificationIndividuals.rdf version of this ontology was revised to address text formatting hygiene issues.
change note: The https://spec.edmcouncil.org/fibo/ontology/SEC/Equities/EquityCFIClassificationIndividuals.rdf version of this ontology was revised to complete the set of possible common share representations corresponding to the CFI standard, complete the set of corresponding codes for common shares (non-convertible), and add the set of possible combinations for preferred shares (non-convertible).
change note: The https://spec.edmcouncil.org/fibo/ontology/SEC/Equities/EquityCFIClassificationIndividuals.rdf version of this ontology was revised to replace uses of hasTag in Relations with hasTag from LCC, as the more complex union of datatypes in the Relations concept is not needed here.
change note: The https://spec.edmcouncil.org/fibo/ontology/SEC/Equities/EquityCFIClassificationIndividuals.rdf version of this ontology was revised to simplify the encoding of the individual instrument classifiers to eliminate unnecessary restrictions.
change note: The https://spec.edmcouncil.org/fibo/ontology/SEC/Equities/EquityCFIClassificationIndividuals.rdf version of this ontology was revised to streamline the representation of voting rights and payment form, eliminate embedded restrictions, and build out additional classes representing the various feature-based descriptions supported by the CFI standard.
has maturity level: Release
copyright: Copyright (c) 2020-2023 EDM Council, Inc.
copyright: Copyright (c) 2020-2023 Object Management Group, Inc.

common, enhanced voting, restricted, fully-paid, registered share
type: Class
subclass of: CommonShare
subclass of: EnhancedVotingShare
subclass of: FullyPaidShare
subclass of: RestrictedShare
subclass of: RegisteredSecurity
subclass of: Restriction
  on property: isClassifiedBy
  has value: ESETFR CFI common/ordinary share classifier
definition: common share that confers multiple votes per share, is restricted from a sales / transfer perspective, is fully paid and is registered

common, enhanced voting, restricted, nil paid, registered share
type: Class
subclass of: CommonShare
subclass of: EnhancedVotingShare
subclass of: NilPaidShare
subclass of: RestrictedShare
subclass of: RegisteredSecurity
subclass of: Restriction
  on property: isClassifiedBy
  has value: ESETOR CFI common/ordinary share classifier
definition: common share that confers multiple votes per share, is restricted from a sales / transfer perspective, is nil paid and is registered

common, enhanced voting, restricted, partly paid, registered share
type: Class
subclass of: CommonShare
subclass of: EnhancedVotingShare
subclass of: PartiallyPaidShare
subclass of: RestrictedShare
subclass of: RegisteredSecurity
subclass of: Restriction
  on property: isClassifiedBy
  has value: ESETPR CFI common/ordinary share classifier
definition: common share that confers multiple votes per share, is restricted from a sales / transfer perspective, is partially paid and is registered

common, enhanced voting, unrestricted, fully-paid, registered share
type: Class
subclass of: CommonShare
subclass of: EnhancedVotingShare
subclass of: FullyPaidShare
subclass of: UnrestrictedShare
subclass of: RegisteredSecurity
subclass of: Restriction
  on property: isClassifiedBy
  has value: ESEUFR CFI common/ordinary share classifier
definition: common share that confers multiple votes per share, is not restricted from a sales / transfer perspective, is fully paid and is registered

common, enhanced voting, unrestricted, nil paid, registered share
type: Class
subclass of: CommonShare
subclass of: EnhancedVotingShare
subclass of: NilPaidShare
subclass of: UnrestrictedShare
subclass of: RegisteredSecurity
subclass of: Restriction
  on property: isClassifiedBy
  has value: ESEUOR CFI common/ordinary share classifier
definition: common share that confers multiple votes per share, is not restricted from a sales / transfer perspective, is nil paid and is registered

common, enhanced voting, unrestricted, partly paid, registered share
type: Class
subclass of: CommonShare
subclass of: EnhancedVotingShare
subclass of: PartiallyPaidShare
subclass of: UnrestrictedShare
subclass of: RegisteredSecurity
subclass of: Restriction
  on property: isClassifiedBy
  has value: ESEUPR CFI common/ordinary share classifier
definition: common share that confers multiple votes per share, is not restricted from a sales / transfer perspective, is partially paid and is registered

common, non-voting, restricted, fully-paid, registered share
type: Class
subclass of: CommonShare
subclass of: FullyPaidShare
subclass of: NonVotingShare
subclass of: RestrictedShare
subclass of: RegisteredSecurity
subclass of: Restriction
  on property: isClassifiedBy
  has value: ESNTFR CFI common/ordinary share classifier
definition: common share that confers exactly 0 votes per share, is restricted from a sales / transfer perspective, is fully paid and is registered

common, non-voting, restricted, nil paid, registered share
type: Class
subclass of: CommonShare
subclass of: NilPaidShare
subclass of: NonVotingShare
subclass of: RestrictedShare
subclass of: RegisteredSecurity
subclass of: Restriction
  on property: isClassifiedBy
  has value: ESNTOR CFI common/ordinary share classifier
definition: common share that confers exactly 0 votes per share, is restricted from a sales / transfer perspective, is nil paid and is registered

common, non-voting, restricted, partly paid, registered share
type: Class
subclass of: CommonShare
subclass of: NonVotingShare
subclass of: PartiallyPaidShare
subclass of: RestrictedShare
subclass of: RegisteredSecurity
subclass of: Restriction
  on property: isClassifiedBy
  has value: ESNTPR CFI common/ordinary share classifier
definition: common share that confers exactly 0 votes per share, is restricted from a sales / transfer perspective, is partially paid and is registered

common, non-voting, unrestricted, fully-paid, registered share
type: Class
subclass of: CommonShare
subclass of: FullyPaidShare
subclass of: NonVotingShare
subclass of: UnrestrictedShare
subclass of: RegisteredSecurity
subclass of: Restriction
  on property: isClassifiedBy
  has value: ESNUFR CFI common/ordinary share classifier
definition: common share that confers exactly 0 votes per share, is unrestricted from a sales perspective, is fully paid and is registered

common, non-voting, unrestricted, nil paid, registered share
type: Class
subclass of: CommonShare
subclass of: NilPaidShare
subclass of: NonVotingShare
subclass of: UnrestrictedShare
subclass of: RegisteredSecurity
subclass of: Restriction
  on property: isClassifiedBy
  has value: ESNUOR CFI common/ordinary share classifier
definition: common share that confers exactly 0 votes per share, is unrestricted from a sales perspective, is nil paid and is registered

common, non-voting, unrestricted, partly paid, registered share
type: Class
subclass of: CommonShare
subclass of: NonVotingShare
subclass of: PartiallyPaidShare
subclass of: UnrestrictedShare
subclass of: RegisteredSecurity
subclass of: Restriction
  on property: isClassifiedBy
  has value: ESNUPR CFI common/ordinary share classifier
definition: common share that confers exactly 0 votes per share, is unrestricted from a sales perspective, is partially paid and is registered

common, restricted voting, restricted, fully-paid, registered share
type: Class
subclass of: CommonShare
subclass of: FullyPaidShare
subclass of: RestrictedShare
subclass of: RestrictedVotingShare
subclass of: RegisteredSecurity
subclass of: Restriction
  on property: isClassifiedBy
  has value: ESRTFR CFI common/ordinary share classifier
definition: common share that confers less than one vote per share, is restricted from a sales / transfer perspective, is fully paid and is registered

common, restricted voting, restricted, nil paid, registered share
type: Class
subclass of: CommonShare
subclass of: NilPaidShare
subclass of: RestrictedShare
subclass of: RestrictedVotingShare
subclass of: RegisteredSecurity
subclass of: Restriction
  on property: isClassifiedBy
  has value: ESRTOR CFI common/ordinary share classifier
definition: common share that confers less than one vote per share, is restricted from a sales / transfer perspective, is nil paid and is registered

common, restricted voting, restricted, partly paid, registered share
type: Class
subclass of: CommonShare
subclass of: PartiallyPaidShare
subclass of: RestrictedShare
subclass of: RestrictedVotingShare
subclass of: RegisteredSecurity
subclass of: Restriction
  on property: isClassifiedBy
  has value: ESRTPR CFI common/ordinary share classifier
definition: common share that confers less than one vote per share, is restricted from a sales / transfer perspective, is partially paid and is registered

common, restricted voting, unrestricted, fully-paid, registered share
type: Class
subclass of: CommonShare
subclass of: FullyPaidShare
subclass of: RestrictedVotingShare
subclass of: UnrestrictedShare
subclass of: RegisteredSecurity
subclass of: Restriction
  on property: isClassifiedBy
  has value: ESRUFR CFI common/ordinary share classifier
definition: common share that confers less than one vote per share, is unrestricted from a sales / transfer perspective, is fully paid and is registered

common, restricted voting, unrestricted, nil paid, registered share
type: Class
subclass of: CommonShare
subclass of: NilPaidShare
subclass of: RestrictedVotingShare
subclass of: UnrestrictedShare
subclass of: RegisteredSecurity
subclass of: Restriction
  on property: isClassifiedBy
  has value: ESRUOR CFI common/ordinary share classifier
definition: common share that confers less than one vote per share, is unrestricted from a sales / transfer perspective, is nil paid and is registered

common, restricted voting, unrestricted, partly paid, registered share
type: Class
subclass of: CommonShare
subclass of: PartiallyPaidShare
subclass of: RestrictedVotingShare
subclass of: UnrestrictedShare
subclass of: RegisteredSecurity
subclass of: Restriction
  on property: isClassifiedBy
  has value: ESRUPR CFI common/ordinary share classifier
definition: common share that confers less than one vote per share, is unrestricted from a sales / transfer perspective, is partially paid and is registered

common, voting, restricted, fully-paid, registered share
type: Class
subclass of: CommonShare
subclass of: FullyPaidShare
subclass of: RestrictedShare
subclass of: SingleVotingShare
subclass of: RegisteredSecurity
subclass of: Restriction
  on property: isClassifiedBy
  has value: ESVTFR CFI common/ordinary share classifier
definition: common share that confers exactly one vote per share, is restricted from a sales / transfer perspective, is fully paid and is registered

common, voting, restricted, nil paid, registered share
type: Class
subclass of: CommonShare
subclass of: NilPaidShare
subclass of: RestrictedShare
subclass of: SingleVotingShare
subclass of: RegisteredSecurity
subclass of: Restriction
  on property: isClassifiedBy
  has value: ESVTOR CFI common/ordinary share classifier
definition: common share that confers exactly one vote per share, is restricted from a sales / transfer perspective, is nil paid and is registered

common, voting, restricted, partly paid, registered share
type: Class
subclass of: CommonShare
subclass of: PartiallyPaidShare
subclass of: RestrictedShare
subclass of: SingleVotingShare
subclass of: RegisteredSecurity
subclass of: Restriction
  on property: isClassifiedBy
  has value: ESVTPR CFI common/ordinary share classifier
definition: common share that confers exactly one vote per share, is restricted from a sales / transfer perspective, is partially paid and is registered

common, voting, unrestricted, fully-paid, registered share
type: Class
subclass of: CommonShare
subclass of: FullyPaidShare
subclass of: SingleVotingShare
subclass of: UnrestrictedShare
subclass of: RegisteredSecurity
subclass of: Restriction
  on property: isClassifiedBy
  has value: ESVUFR CFI common/ordinary share classifier
definition: common share that confers exactly one vote per share, is unrestricted from a sales perspective, is fully paid and is registered

common, voting, unrestricted, nil paid, registered share
type: Class
subclass of: CommonShare
subclass of: NilPaidShare
subclass of: SingleVotingShare
subclass of: UnrestrictedShare
subclass of: RegisteredSecurity
subclass of: Restriction
  on property: isClassifiedBy
  has value: ESVUOR CFI common/ordinary share classifier
definition: common share that confers exactly one vote per share, is unrestricted from a sales perspective, is nil paid and is registered

common, voting, unrestricted, partly paid, registered share
type: Class
subclass of: CommonShare
subclass of: PartiallyPaidShare
subclass of: SingleVotingShare
subclass of: UnrestrictedShare
subclass of: RegisteredSecurity
subclass of: Restriction
  on property: isClassifiedBy
  has value: ESVUPR CFI common/ordinary share classifier
definition: common share that confers exactly one vote per share, is unrestricted from a sales perspective, is partially paid and is registered

ESETFR CFI common/ordinary share classifier
type: NamedIndividual
type: FinancialInstrumentClassificationCode
definition: CFI code for a common, enhanced voting, restricted transfer, fully-paid, registered share
has tag: ESETFR
is member of: ISO10962-201910-CodeScheme

ESETOR CFI common/ordinary share classifier
type: NamedIndividual
type: FinancialInstrumentClassificationCode
definition: CFI code for a common, enhanced voting, restricted transfer, nil paid, registered share
has tag: ESETOR
is member of: ISO10962-201910-CodeScheme

ESETPR CFI common/ordinary share classifier
type: NamedIndividual
type: FinancialInstrumentClassificationCode
definition: CFI code for a common, enhanced voting, restricted transfer, partly paid, registered share
has tag: ESETPR
is member of: ISO10962-201910-CodeScheme

ESEUFR CFI common/ordinary share classifier
type: NamedIndividual
type: FinancialInstrumentClassificationCode
definition: CFI code for a common, enhanced voting, unrestricted transfer, fully-paid, registered share
has tag: ESEUFR
is member of: ISO10962-201910-CodeScheme

ESEUOR CFI common/ordinary share classifier
type: NamedIndividual
type: FinancialInstrumentClassificationCode
definition: CFI code for a common, enhanced voting, unrestricted transfer, nil paid, registered share
has tag: ESEUOR
is member of: ISO10962-201910-CodeScheme

ESEUPR CFI common/ordinary share classifier
type: NamedIndividual
type: FinancialInstrumentClassificationCode
definition: CFI code for a common, enhanced voting, unrestricted transfer, partially paid, registered share
has tag: ESEUPR
is member of: ISO10962-201910-CodeScheme

ESNTFR CFI common/ordinary share classifier
type: NamedIndividual
type: FinancialInstrumentClassificationCode
definition: CFI code for a common, non-voting, restricted transfer, fully-paid, registered share
has tag: ESNTFR
is member of: ISO10962-201910-CodeScheme

ESNTOR CFI common/ordinary share classifier
type: NamedIndividual
type: FinancialInstrumentClassificationCode
definition: CFI code for a common, non-voting, restricted transfer, nil paid, registered share
has tag: ESNTOR
is member of: ISO10962-201910-CodeScheme

ESNTPR CFI common/ordinary share classifier
type: NamedIndividual
type: FinancialInstrumentClassificationCode
definition: CFI code for a common, non-voting, restricted transfer, partially paid, registered share
has tag: ESNTPR
is member of: ISO10962-201910-CodeScheme

ESNUFR CFI common/ordinary share classifier
type: NamedIndividual
type: FinancialInstrumentClassificationCode
definition: CFI code for a common, non-voting, unrestricted transfer, fully-paid, registered share
has tag: ESNUFR
is member of: ISO10962-201910-CodeScheme

ESNUOR CFI common/ordinary share classifier
type: NamedIndividual
type: FinancialInstrumentClassificationCode
definition: CFI code for a common, non-voting, unrestricted transfer, nil paid, registered share
has tag: ESNUOR
is member of: ISO10962-201910-CodeScheme

ESNUPR CFI common/ordinary share classifier
type: NamedIndividual
type: FinancialInstrumentClassificationCode
definition: CFI code for a common, non-voting, unrestricted transfer, partially paid, registered share
has tag: ESNUPR
is member of: ISO10962-201910-CodeScheme

ESRTFR CFI common/ordinary share classifier
type: NamedIndividual
type: FinancialInstrumentClassificationCode
definition: CFI code for a common, restricted voting, restricted transfer, fully-paid, registered share
has tag: ESRTFR
is member of: ISO10962-201910-CodeScheme

ESRTOR CFI common/ordinary share classifier
type: NamedIndividual
type: FinancialInstrumentClassificationCode
definition: CFI code for a common, restricted voting, restricted transfer, nil paid, registered share
has tag: ESRTOR
is member of: ISO10962-201910-CodeScheme

ESRTPR CFI common/ordinary share classifier
type: NamedIndividual
type: FinancialInstrumentClassificationCode
definition: CFI code for a common, restricted voting, restricted transfer, partly paid, registered share
has tag: ESRTPR
is member of: ISO10962-201910-CodeScheme

ESRUFR CFI common/ordinary share classifier
type: NamedIndividual
type: FinancialInstrumentClassificationCode
definition: CFI code for a common, restricted voting, unrestricted transfer, fully-paid, registered share
has tag: ESRUFR
is member of: ISO10962-201910-CodeScheme

ESRUOR CFI common/ordinary share classifier
type: NamedIndividual
type: FinancialInstrumentClassificationCode
definition: CFI code for a common, restricted voting, unrestricted transfer, nil paid, registered share
has tag: ESRUOR
is member of: ISO10962-201910-CodeScheme

ESRUPR CFI common/ordinary share classifier
type: NamedIndividual
type: FinancialInstrumentClassificationCode
definition: CFI code for a common, restricted voting, unrestricted transfer, partly paid, registered share
has tag: ESRUPR
is member of: ISO10962-201910-CodeScheme

ESVTFR CFI common/ordinary share classifier
type: NamedIndividual
type: FinancialInstrumentClassificationCode
definition: CFI code for a common, voting, restricted transfer, fully-paid, registered share
has tag: ESVTFR
is member of: ISO10962-201910-CodeScheme

ESVTOR CFI common/ordinary share classifier
type: NamedIndividual
type: FinancialInstrumentClassificationCode
definition: CFI code for a common, voting, restricted transfer, nil paid, registered share
has tag: ESVTOR
is member of: ISO10962-201910-CodeScheme

ESVTPR CFI common/ordinary share classifier
type: NamedIndividual
type: FinancialInstrumentClassificationCode
definition: CFI code for a common, voting, restricted transfer, partly paid, registered share
has tag: ESVTPR
is member of: ISO10962-201910-CodeScheme

ESVUFR CFI common/ordinary share classifier
type: NamedIndividual
type: FinancialInstrumentClassificationCode
definition: CFI code for a common, voting, unrestricted transfer, fully-paid, registered share
has tag: ESVUFR
is member of: ISO10962-201910-CodeScheme

ESVUOR CFI common/ordinary share classifier
type: NamedIndividual
type: FinancialInstrumentClassificationCode
definition: CFI code for a common, voting, unrestricted transfer, nil paid, registered share
has tag: ESVUOR
is member of: ISO10962-201910-CodeScheme

ESVUPR CFI common/ordinary share classifier
type: NamedIndividual
type: FinancialInstrumentClassificationCode
definition: CFI code for a common, voting, unrestricted transfer, partly paid, registered share
has tag: ESVUPR
is member of: ISO10962-201910-CodeScheme

preferred, enhanced voting, exchangeable, adjustable income, registered share
type: Class
subclass of: EnhancedVotingShare
subclass of: ExchangeablePreferredShare
subclass of: PreferredShareWithAdjustableRateDividend
subclass of: RegisteredSecurity
definition: preferred share that confers multiple votes per share, may be exchanged for securities of another issuer, provides a periodic income whose dividend rate is set periodically, and is registered

preferred, enhanced voting, exchangeable, auction rate income, registered share
type: Class
subclass of: EnhancedVotingShare
subclass of: ExchangeablePreferredShare
subclass of: PreferredShareWithAuctionRateDividend
subclass of: RegisteredSecurity
definition: preferred share that confers multiple votes per share, may be exchanged for securities of another issuer, provides a periodic income whose dividend rate is adjusted through an auction, and is registered

preferred, enhanced voting, exchangeable, cumulative participating, registered share
type: Class
subclass of: CumulativePreferredShare
subclass of: EnhancedVotingShare
subclass of: ExchangeablePreferredShare
subclass of: ParticipatingPreferredShare
subclass of: PreferredShareWithFixedRateDividend
subclass of: RegisteredSecurity
definition: preferred share that confers multiple votes per share, may be exchanged for securities of another issuer, provides a periodic stated income, dividends not paid in any year accumulate, and participates with common shareholders in further dividend and capital distributions, and is registered

preferred, enhanced voting, exchangeable, cumulative, registered share
type: Class
subclass of: CumulativePreferredShare
subclass of: EnhancedVotingShare
subclass of: ExchangeablePreferredShare
subclass of: NonParticipatingPreferredShare
subclass of: PreferredShareWithFixedRateDividend
subclass of: RegisteredSecurity
definition: preferred share that confers multiple votes per share, may be exchanged for securities of another issuer, provides a periodic stated income and dividends not paid in any year accumulate, and is registered

preferred, enhanced voting, exchangeable, fixed income, registered share
type: Class
subclass of: EnhancedVotingShare
subclass of: ExchangeablePreferredShare
subclass of: NonCumulativePreferredShare
subclass of: NonParticipatingPreferredShare
subclass of: PreferredShareWithFixedRateDividend
subclass of: RegisteredSecurity
definition: preferred share that confers multiple votes per share, may be exchanged for securities of another issuer, provides a periodic stated income, and is registered

preferred, enhanced voting, exchangeable, normal income, registered share
type: Class
subclass of: EnhancedVotingShare
subclass of: ExchangeablePreferredShare
subclass of: NonCumulativePreferredShare
subclass of: RegisteredSecurity
definition: preferred share that confers multiple votes per share, may be exchanged for securities of another issuer, provides the same dividends as common/ordinary shareholders, and is registered

preferred, enhanced voting, exchangeable, participating, registered share
type: Class
subclass of: EnhancedVotingShare
subclass of: ExchangeablePreferredShare
subclass of: NonCumulativePreferredShare
subclass of: ParticipatingPreferredShare
subclass of: PreferredShareWithFixedRateDividend
subclass of: RegisteredSecurity
definition: preferred share that confers multiple votes per share, may be exchanged for securities of another issuer, provides a periodic stated income and participates with common shareholders in further dividend and capital distributions, and is registered

preferred, enhanced voting, extendable, adjustable income, registered share
type: Class
subclass of: EnhancedVotingShare
subclass of: ExtendablePreferredShare
subclass of: PreferredShareWithAdjustableRateDividend
subclass of: RegisteredSecurity
subclass of: Class
  union of: RedeemablePreferredShareWithExtendableRedemptionDate
  union of: RetractablePreferredShareWithExtendableRedemptionDate
definition: preferred share that confers multiple votes per share, may be redeemed at the option of the issuer and/or of the shareholder with an extendable redemption date, provides a periodic income whose dividend rate is set periodically, and is registered

preferred, enhanced voting, extendable, auction rate income, registered share
type: Class
subclass of: EnhancedVotingShare
subclass of: ExtendablePreferredShare
subclass of: PreferredShareWithAuctionRateDividend
subclass of: RegisteredSecurity
subclass of: Class
  union of: RedeemablePreferredShareWithExtendableRedemptionDate
  union of: RetractablePreferredShareWithExtendableRedemptionDate
definition: preferred share that confers multiple votes per share, may be redeemed at the option of the issuer and/or of the shareholder with an extendable redemption date, provides a periodic income whose dividend rate is adjusted through an auction, and is registered

preferred, enhanced voting, extendable, cumulative participating, registered share
type: Class
subclass of: CumulativePreferredShare
subclass of: EnhancedVotingShare
subclass of: ExtendablePreferredShare
subclass of: ParticipatingPreferredShare
subclass of: PreferredShareWithFixedRateDividend
subclass of: RegisteredSecurity
subclass of: Class
  union of: RedeemablePreferredShareWithExtendableRedemptionDate
  union of: RetractablePreferredShareWithExtendableRedemptionDate
definition: preferred share that confers multiple votes per share, may be redeemed at the option of the issuer and/or of the shareholder with an extendable redemption date, provides a periodic stated income, dividends not paid in any year accumulate, and participates with common shareholders in further dividend and capital distributions, and is registered

preferred, enhanced voting, extendable, cumulative, registered share
type: Class
subclass of: CumulativePreferredShare
subclass of: EnhancedVotingShare
subclass of: ExtendablePreferredShare
subclass of: NonParticipatingPreferredShare
subclass of: PreferredShareWithFixedRateDividend
subclass of: RegisteredSecurity
subclass of: Class
  union of: RedeemablePreferredShareWithExtendableRedemptionDate
  union of: RetractablePreferredShareWithExtendableRedemptionDate
definition: preferred share that confers multiple votes per share, may be redeemed at the option of the issuer and/or of the shareholder with an extendable redemption date, provides a periodic stated income and dividends not paid in any year accumulate, and is registered

preferred, enhanced voting, extendable, fixed income, registered share
type: Class
subclass of: EnhancedVotingShare
subclass of: ExtendablePreferredShare
subclass of: NonCumulativePreferredShare
subclass of: NonParticipatingPreferredShare
subclass of: PreferredShareWithFixedRateDividend
subclass of: RegisteredSecurity
subclass of: Class
  union of: RedeemablePreferredShareWithExtendableRedemptionDate
  union of: RetractablePreferredShareWithExtendableRedemptionDate
definition: preferred share that confers multiple votes per share, may be redeemed at the option of the issuer and/or of the shareholder with an extendable redemption date, provides a periodic stated income, and is registered

preferred, enhanced voting, extendable, normal income, registered share
type: Class
subclass of: EnhancedVotingShare
subclass of: ExtendablePreferredShare
subclass of: NonCumulativePreferredShare
subclass of: RegisteredSecurity
subclass of: Class
  union of: RedeemablePreferredShareWithExtendableRedemptionDate
  union of: RetractablePreferredShareWithExtendableRedemptionDate
definition: preferred share that confers multiple votes per share, may be redeemed at the option of the issuer and/or of the shareholder with an extendable redemption date, provides the same dividends as common/ordinary shareholders, and is registered

preferred, enhanced voting, extendable, participating, registered share
type: Class
subclass of: EnhancedVotingShare
subclass of: ExtendablePreferredShare
subclass of: NonCumulativePreferredShare
subclass of: ParticipatingPreferredShare
subclass of: PreferredShareWithFixedRateDividend
subclass of: RegisteredSecurity
subclass of: Class
  union of: RedeemablePreferredShareWithExtendableRedemptionDate
  union of: RetractablePreferredShareWithExtendableRedemptionDate
definition: preferred share that confers multiple votes per share, may be redeemed at the option of the issuer and/or of the shareholder with an extendable redemption date, provides a periodic stated income and participates with common shareholders in further dividend and capital distributions, and is registered

preferred, enhanced voting, perpetual, adjustable income, registered share
type: Class
subclass of: EnhancedVotingShare
subclass of: PerpetualPreferredShare
subclass of: PreferredShareWithAdjustableRateDividend
subclass of: RegisteredSecurity
definition: preferred share that confers multiple votes per share, has no fixed maturity date, provides a periodic income whose dividend rate is set periodically, and is registered

preferred, enhanced voting, perpetual, auction rate income, registered share
type: Class
subclass of: EnhancedVotingShare
subclass of: PerpetualPreferredShare
subclass of: PreferredShareWithAuctionRateDividend
subclass of: RegisteredSecurity
definition: preferred share that confers multiple votes per share, has no fixed maturity date, provides a periodic income whose dividend rate is adjusted through an auction, and is registered

preferred, enhanced voting, perpetual, cumulative participating, registered share
type: Class
subclass of: CumulativePreferredShare
subclass of: EnhancedVotingShare
subclass of: ParticipatingPreferredShare
subclass of: PerpetualPreferredShare
subclass of: PreferredShareWithFixedRateDividend
subclass of: RegisteredSecurity
definition: preferred share that confers multiple votes per share, has no fixed maturity date, provides a periodic stated income, dividends not paid in any year accumulate, and participates with common shareholders in further dividend and capital distributions, and is registered

preferred, enhanced voting, perpetual, cumulative, registered share
type: Class
subclass of: CumulativePreferredShare
subclass of: EnhancedVotingShare
subclass of: NonParticipatingPreferredShare
subclass of: PerpetualPreferredShare
subclass of: PreferredShareWithFixedRateDividend
subclass of: RegisteredSecurity
definition: preferred share that confers multiple votes per share, has no fixed maturity date, provides a periodic stated income and dividends not paid in any year accumulate, and is registered

preferred, enhanced voting, perpetual, fixed income, registered share
type: Class
subclass of: EnhancedVotingShare
subclass of: NonCumulativePreferredShare
subclass of: NonParticipatingPreferredShare
subclass of: PerpetualPreferredShare
subclass of: PreferredShareWithFixedRateDividend
subclass of: RegisteredSecurity
definition: preferred share that confers multiple votes per share, has no fixed maturity date, provides a periodic stated income, and is registered

preferred, enhanced voting, perpetual, normal income, registered share
type: Class
subclass of: EnhancedVotingShare
subclass of: NonCumulativePreferredShare
subclass of: PerpetualPreferredShare
subclass of: RegisteredSecurity
definition: preferred share that confers multiple votes per share, has no fixed maturity date, provides the same dividends as common/ordinary shareholders, and is registered

preferred, enhanced voting, perpetual, participating, registered share
type: Class
subclass of: EnhancedVotingShare
subclass of: NonCumulativePreferredShare
subclass of: ParticipatingPreferredShare
subclass of: PerpetualPreferredShare
subclass of: PreferredShareWithFixedRateDividend
subclass of: RegisteredSecurity
definition: preferred share that confers multiple votes per share, has no fixed maturity date, provides a periodic stated income and participates with common shareholders in further dividend and capital distributions, and is registered

preferred, enhanced voting, redeemable, adjustable income, registered share
type: Class
subclass of: EnhancedVotingShare
subclass of: PreferredShareWithAdjustableRateDividend
subclass of: RegisteredSecurity
subclass of: Class
  union of: RedeemablePreferredShare
  union of: RetractablePreferredShare
definition: preferred share that confers multiple votes per share, may be redeemed at the option of the issuer and/or of the shareholder, provides a periodic income whose dividend rate is set periodically, and is registered

preferred, enhanced voting, redeemable, auction rate income, registered share
type: Class
subclass of: EnhancedVotingShare
subclass of: PreferredShareWithAuctionRateDividend
subclass of: RegisteredSecurity
subclass of: Class
  union of: RedeemablePreferredShare
  union of: RetractablePreferredShare
definition: preferred share that confers multiple votes per share, may be redeemed at the option of the issuer and/or of the shareholder, provides a periodic income whose dividend rate is adjusted through an auction, and is registered

preferred, enhanced voting, redeemable, cumulative participating, registered share
type: Class
subclass of: CumulativePreferredShare
subclass of: EnhancedVotingShare
subclass of: ParticipatingPreferredShare
subclass of: PreferredShareWithFixedRateDividend
subclass of: RegisteredSecurity
subclass of: Class
  union of: RedeemablePreferredShare
  union of: RetractablePreferredShare
definition: preferred share that confers multiple votes per share, may be redeemed at the option of the issuer and/or of the shareholder, provides a periodic stated income, dividends not paid in any year accumulate, and participates with common shareholders in further dividend and capital distributions, and is registered

preferred, enhanced voting, redeemable, cumulative, registered share
type: Class
subclass of: CumulativePreferredShare
subclass of: EnhancedVotingShare
subclass of: NonParticipatingPreferredShare
subclass of: PreferredShareWithFixedRateDividend
subclass of: RegisteredSecurity
subclass of: Class
  union of: RedeemablePreferredShare
  union of: RetractablePreferredShare
definition: preferred share that confers multiple votes per share, may be redeemed at the option of the issuer and/or of the shareholder, provides a periodic stated income and dividends not paid in any year accumulate, and is registered

preferred, enhanced voting, redeemable exchangeable, adjustable income, registered share
type: Class
subclass of: EnhancedVotingShare
subclass of: ExchangeablePreferredShare
subclass of: PreferredShareWithAdjustableRateDividend
subclass of: RegisteredSecurity
subclass of: Class
  union of: RedeemablePreferredShare
  union of: RetractablePreferredShare
definition: preferred share that confers multiple votes per share, may be redeemed at the option of the issuer and/or of the shareholder, provides a periodic income whose dividend rate is set periodically, and is registered

preferred, enhanced voting, redeemable exchangeable, auction rate income, registered share
type: Class
subclass of: EnhancedVotingShare
subclass of: ExchangeablePreferredShare
subclass of: PreferredShareWithAuctionRateDividend
subclass of: RegisteredSecurity
subclass of: Class
  union of: RedeemablePreferredShare
  union of: RetractablePreferredShare
definition: preferred share that confers multiple votes per share, may be redeemed at the option of the issuer and/or of the shareholder, provides a periodic income whose dividend rate is adjusted through an auction, and is registered

preferred, enhanced voting, redeemable exchangeable, cumulative participating, registered share
type: Class
subclass of: CumulativePreferredShare
subclass of: EnhancedVotingShare
subclass of: ExchangeablePreferredShare
subclass of: ParticipatingPreferredShare
subclass of: PreferredShareWithFixedRateDividend
subclass of: RegisteredSecurity
subclass of: Class
  union of: RedeemablePreferredShare
  union of: RetractablePreferredShare
definition: preferred share that confers multiple votes per share, may be exchanged for securities of another issuer, may be redeemed at the option of the issuer and/or of the shareholder, provides a periodic stated income, dividends not paid in any year accumulate, and participates with common shareholders in further dividend and capital distributions, and is registered

preferred, enhanced voting, redeemable exchangeable, cumulative, registered share
type: Class
subclass of: CumulativePreferredShare
subclass of: EnhancedVotingShare
subclass of: ExchangeablePreferredShare
subclass of: NonParticipatingPreferredShare
subclass of: PreferredShareWithFixedRateDividend
subclass of: RegisteredSecurity
subclass of: Class
  union of: RedeemablePreferredShare
  union of: RetractablePreferredShare
definition: preferred share that confers multiple votes per share, may be exchanged for securities of another issuer, may be redeemed at the option of the issuer and/or of the shareholder, provides a periodic stated income and dividends not paid in any year accumulate, and is registered

preferred, enhanced voting, redeemable/exchangeable/extendable, adjustable income, registered share
type: Class
subclass of: EnhancedVotingShare
subclass of: ExchangeablePreferredShare
subclass of: ExtendablePreferredShare
subclass of: PreferredShareWithAdjustableRateDividend
subclass of: RegisteredSecurity
subclass of: Class
  union of: RedeemablePreferredShareWithExtendableMaturityDate
  union of: RetractablePreferredShareWithExtendableMaturityDate
definition: preferred share that confers multiple votes per share, may be exchanged for securities of another issuer, whose issuer and/or shareholders have the option to extend the maturity date, that provides a periodic income whose dividend rate is set periodically, and is registered

preferred, enhanced voting, redeemable/exchangeable/extendable, auction rate income, registered share
type: Class
subclass of: EnhancedVotingShare
subclass of: ExchangeablePreferredShare
subclass of: ExtendablePreferredShare
subclass of: PreferredShareWithAuctionRateDividend
subclass of: RegisteredSecurity
subclass of: Class
  union of: RedeemablePreferredShareWithExtendableMaturityDate
  union of: RetractablePreferredShareWithExtendableMaturityDate
definition: preferred share that confers multiple votes per share, may be exchanged for securities of another issuer, whose issuer and/or shareholders have the option to extend the maturity date, that provides a periodic income whose dividend rate is adjusted through an auction, and is registered

preferred, enhanced voting, redeemable/exchangeable/extendable, cumulative participating, registered share
type: Class
subclass of: CumulativePreferredShare
subclass of: EnhancedVotingShare
subclass of: ExchangeablePreferredShare
subclass of: ExtendablePreferredShare
subclass of: ParticipatingPreferredShare
subclass of: PreferredShareWithFixedRateDividend
subclass of: RegisteredSecurity
subclass of: Class
  union of: RedeemablePreferredShareWithExtendableMaturityDate
  union of: RetractablePreferredShareWithExtendableMaturityDate
definition: preferred share that confers multiple votes per share, may be exchanged for securities of another issuer, whose issuer and/or shareholders have the option to extend the maturity date, that provides a periodic stated income, dividends not paid in any year accumulate, and participates with common shareholders in further dividend and capital distributions, and is registered

preferred, enhanced voting, redeemable/exchangeable/extendable, cumulative, registered share
type: Class
subclass of: CumulativePreferredShare
subclass of: EnhancedVotingShare
subclass of: ExchangeablePreferredShare
subclass of: ExtendablePreferredShare
subclass of: NonParticipatingPreferredShare
subclass of: PreferredShareWithFixedRateDividend
subclass of: RegisteredSecurity
subclass of: Class
  union of: RedeemablePreferredShareWithExtendableMaturityDate
  union of: RetractablePreferredShareWithExtendableMaturityDate
definition: preferred share that confers multiple votes per share, may be exchanged for securities of another issuer, whose issuer and/or shareholders have the option to extend the maturity date, that provides a periodic stated income and dividends not paid in any year accumulate, and is registered

preferred, enhanced voting, redeemable/exchangeable/extendable, fixed income, registered share
type: Class
subclass of: EnhancedVotingShare
subclass of: ExchangeablePreferredShare
subclass of: ExtendablePreferredShare
subclass of: NonCumulativePreferredShare
subclass of: NonParticipatingPreferredShare
subclass of: PreferredShareWithFixedRateDividend
subclass of: RegisteredSecurity
subclass of: Class
  union of: RedeemablePreferredShareWithExtendableMaturityDate
  union of: RetractablePreferredShareWithExtendableMaturityDate
definition: preferred share that confers multiple votes per share, may be exchanged for securities of another issuer, whose issuer and/or shareholders have the option to extend the maturity date, that provides a periodic stated income, and is registered

preferred, enhanced voting, redeemable/exchangeable/extendable, normal income, registered share
type: Class
subclass of: EnhancedVotingShare
subclass of: ExchangeablePreferredShare
subclass of: ExtendablePreferredShare
subclass of: NonCumulativePreferredShare
subclass of: RegisteredSecurity
subclass of: Class
  union of: RedeemablePreferredShareWithExtendableMaturityDate
  union of: RetractablePreferredShareWithExtendableMaturityDate
definition: preferred share that confers multiple votes per share, may be exchanged for securities of another issuer, whose issuer and/or shareholders have the option to extend the maturity date, that provides the same dividends as common/ordinary shareholders, and is registered

preferred, enhanced voting, redeemable/exchangeable/extendable, participating, registered share
type: Class
subclass of: EnhancedVotingShare
subclass of: ExchangeablePreferredShare
subclass of: ExtendablePreferredShare
subclass of: NonCumulativePreferredShare
subclass of: ParticipatingPreferredShare
subclass of: PreferredShareWithFixedRateDividend
subclass of: RegisteredSecurity
subclass of: Class
  union of: RedeemablePreferredShareWithExtendableMaturityDate
  union of: RetractablePreferredShareWithExtendableMaturityDate
definition: preferred share that confers multiple votes per share, may be exchanged for securities of another issuer, whose issuer and/or shareholders have the option to extend the maturity date, that provides a periodic stated income and participates with common shareholders in further dividend and capital distributions, and is registered

preferred, enhanced voting, redeemable exchangeable, fixed income, registered share
type: Class
subclass of: EnhancedVotingShare
subclass of: ExchangeablePreferredShare
subclass of: NonCumulativePreferredShare
subclass of: NonParticipatingPreferredShare
subclass of: PreferredShareWithFixedRateDividend
subclass of: RegisteredSecurity
subclass of: Class
  union of: RedeemablePreferredShare
  union of: RetractablePreferredShare
definition: preferred share that confers multiple votes per share, may be exchanged for securities of another issuer, may be redeemed at the option of the issuer and/or of the shareholder, provides a periodic stated income, and is registered

preferred, enhanced voting, redeemable exchangeable, normal income, registered share
type: Class
subclass of: EnhancedVotingShare
subclass of: ExchangeablePreferredShare
subclass of: RegisteredSecurity
subclass of: Class
  union of: RedeemablePreferredShare
  union of: RetractablePreferredShare
definition: preferred share that confers multiple votes per share, may be exchanged for securities of another issuer, may be redeemed at the option of the issuer and/or of the shareholder, provides the same dividends as common/ordinary shareholders, and is registered

preferred, enhanced voting, redeemable exchangeable, participating, registered share
type: Class
subclass of: EnhancedVotingShare
subclass of: ExchangeablePreferredShare
subclass of: NonCumulativePreferredShare
subclass of: ParticipatingPreferredShare
subclass of: PreferredShareWithFixedRateDividend
subclass of: RegisteredSecurity
subclass of: Class
  union of: RedeemablePreferredShare
  union of: RetractablePreferredShare
definition: preferred share that confers multiple votes per share, may be exchanged for securities of another issuer, may be redeemed at the option of the issuer and/or of the shareholder, provides a periodic stated income and participates with common shareholders in further dividend and capital distributions, and is registered

preferred, enhanced voting, redeemable extendable, adjustable income, registered share
type: Class
subclass of: EnhancedVotingShare
subclass of: ExtendablePreferredShare
subclass of: PreferredShareWithAdjustableRateDividend
subclass of: RegisteredSecurity
subclass of: Class
  union of: RedeemablePreferredShareWithExtendableMaturityDate
  union of: RetractablePreferredShareWithExtendableMaturityDate
definition: preferred share that confers multiple votes per share, whose issuer and/or shareholders have the option to extend the maturity date, that provides a periodic income whose dividend rate is set periodically, and is registered

preferred, enhanced voting, redeemable extendable, auction rate income, registered share
type: Class
subclass of: EnhancedVotingShare
subclass of: ExtendablePreferredShare
subclass of: PreferredShareWithAuctionRateDividend
subclass of: RegisteredSecurity
subclass of: Class
  union of: RedeemablePreferredShareWithExtendableMaturityDate
  union of: RetractablePreferredShareWithExtendableMaturityDate
definition: preferred share that confers multiple votes per share, whose issuer and/or shareholders have the option to extend the maturity date, that provides a periodic income whose dividend rate is adjusted through an auction, and is registered

preferred, enhanced voting, redeemable extendable, cumulative participating, registered share
type: Class
subclass of: CumulativePreferredShare
subclass of: EnhancedVotingShare
subclass of: ExtendablePreferredShare
subclass of: ParticipatingPreferredShare
subclass of: PreferredShareWithFixedRateDividend
subclass of: RegisteredSecurity
subclass of: Class
  union of: RedeemablePreferredShareWithExtendableMaturityDate
  union of: RetractablePreferredShareWithExtendableMaturityDate
definition: preferred share that confers multiple votes per share, whose issuer and/or shareholders have the option to extend the maturity date, that provides a periodic stated income, dividends not paid in any year accumulate, and participates with common shareholders in further dividend and capital distributions, and is registered

preferred, enhanced voting, redeemable extendable, cumulative, registered share
type: Class
subclass of: CumulativePreferredShare
subclass of: EnhancedVotingShare
subclass of: ExtendablePreferredShare
subclass of: NonParticipatingPreferredShare
subclass of: PreferredShareWithFixedRateDividend
subclass of: RegisteredSecurity
subclass of: Class
  union of: RedeemablePreferredShareWithExtendableMaturityDate
  union of: RetractablePreferredShareWithExtendableMaturityDate
definition: preferred share that confers multiple votes per share, whose issuer and/or shareholders have the option to extend the maturity date, that provides a periodic stated income and dividends not paid in any year accumulate, and is registered

preferred, enhanced voting, redeemable extendable, fixed income, registered share
type: Class
subclass of: EnhancedVotingShare
subclass of: ExtendablePreferredShare
subclass of: NonCumulativePreferredShare
subclass of: NonParticipatingPreferredShare
subclass of: PreferredShareWithFixedRateDividend
subclass of: RegisteredSecurity
subclass of: Class
  union of: RedeemablePreferredShareWithExtendableMaturityDate
  union of: RetractablePreferredShareWithExtendableMaturityDate
definition: preferred share that confers multiple votes per share, whose issuer and/or shareholders have the option to extend the maturity date, that provides a periodic stated income, and is registered

preferred, enhanced voting, redeemable extendable, normal income, registered share
type: Class
subclass of: EnhancedVotingShare
subclass of: ExtendablePreferredShare
subclass of: RegisteredSecurity
subclass of: Class
  union of: RedeemablePreferredShareWithExtendableMaturityDate
  union of: RetractablePreferredShareWithExtendableMaturityDate
definition: preferred share that confers multiple votes per share, whose issuer and/or shareholders have the option to extend the maturity date, that provides the same dividends as common/ordinary shareholders, and is registered

preferred, enhanced voting, redeemable extendable, participating, registered share
type: Class
subclass of: EnhancedVotingShare
subclass of: ExtendablePreferredShare
subclass of: NonCumulativePreferredShare
subclass of: ParticipatingPreferredShare
subclass of: PreferredShareWithFixedRateDividend
subclass of: RegisteredSecurity
subclass of: Class
  union of: RedeemablePreferredShareWithExtendableMaturityDate
  union of: RetractablePreferredShareWithExtendableMaturityDate
definition: preferred share that confers multiple votes per share, whose issuer and/or shareholders have the option to extend the maturity date, that provides a periodic stated income and participates with common shareholders in further dividend and capital distributions, and is registered

preferred, enhanced voting, redeemable, fixed income, registered share
type: Class
subclass of: EnhancedVotingShare
subclass of: NonCumulativePreferredShare
subclass of: NonParticipatingPreferredShare
subclass of: PreferredShareWithFixedRateDividend
subclass of: RegisteredSecurity
subclass of: Class
  union of: RedeemablePreferredShare
  union of: RetractablePreferredShare
definition: preferred share that confers multiple votes per share, may be redeemed at the option of the issuer and/or of the shareholder, provides a periodic stated income, and is registered

preferred, enhanced voting, redeemable, normal income, registered share
type: Class
subclass of: EnhancedVotingShare
subclass of: RegisteredSecurity
subclass of: Class
  union of: RedeemablePreferredShare
  union of: RetractablePreferredShare
definition: preferred share that confers multiple votes per share, may be redeemed at the option of the issuer and/or of the shareholder, provides the same dividends as common/ordinary shareholders, and is registered

preferred, enhanced voting, redeemable, participating, registered share
type: Class
subclass of: EnhancedVotingShare
subclass of: NonCumulativePreferredShare
subclass of: ParticipatingPreferredShare
subclass of: PreferredShareWithFixedRateDividend
subclass of: RegisteredSecurity
subclass of: Class
  union of: RedeemablePreferredShare
  union of: RetractablePreferredShare
definition: preferred share that confers multiple votes per share, may be redeemed at the option of the issuer and/or of the shareholder, provides a periodic stated income and participates with common shareholders in further dividend and capital distributions, and is registered

preferred, non-voting, exchangeable, adjustable income, registered share
type: Class
subclass of: ExchangeablePreferredShare
subclass of: NonVotingShare
subclass of: PreferredShareWithAdjustableRateDividend
subclass of: RegisteredSecurity
definition: preferred share that confers zero votes per share, may be exchanged for securities of another issuer, provides a periodic income whose dividend rate is set periodically, and is registered

preferred, non-voting, exchangeable, auction rate income, registered share
type: Class
subclass of: ExchangeablePreferredShare
subclass of: NonVotingShare
subclass of: PreferredShareWithAuctionRateDividend
subclass of: RegisteredSecurity
definition: preferred share that confers zero votes per share, may be exchanged for securities of another issuer, provides a periodic income whose dividend rate is adjusted through an auction, and is registered

preferred, non-voting, exchangeable, cumulative participating, registered share
type: Class
subclass of: CumulativePreferredShare
subclass of: ExchangeablePreferredShare
subclass of: NonVotingShare
subclass of: ParticipatingPreferredShare
subclass of: PreferredShareWithFixedRateDividend
subclass of: RegisteredSecurity
definition: preferred share that confers zero votes per share, may be exchanged for securities of another issuer, provides a periodic stated income, dividends not paid in any year accumulate, and participates with common shareholders in further dividend and capital distributions, and is registered

preferred, non-voting, exchangeable, cumulative, registered share
type: Class
subclass of: CumulativePreferredShare
subclass of: ExchangeablePreferredShare
subclass of: NonParticipatingPreferredShare
subclass of: NonVotingShare
subclass of: PreferredShareWithFixedRateDividend
subclass of: RegisteredSecurity
definition: preferred share that confers zero votes per share, may be exchanged for securities of another issuer, provides a periodic stated income and dividends not paid in any year accumulate, and is registered

preferred, non-voting, exchangeable, fixed income, registered share
type: Class
subclass of: ExchangeablePreferredShare
subclass of: NonCumulativePreferredShare
subclass of: NonParticipatingPreferredShare
subclass of: NonVotingShare
subclass of: PreferredShareWithFixedRateDividend
subclass of: RegisteredSecurity
definition: preferred share that confers zero votes per share, may be exchanged for securities of another issuer, provides a periodic stated income, and is registered

preferred, non-voting, exchangeable, normal income, registered share
type: Class
subclass of: ExchangeablePreferredShare
subclass of: NonCumulativePreferredShare
subclass of: NonVotingShare
subclass of: RegisteredSecurity
definition: preferred share that confers zero votes per share, may be exchanged for securities of another issuer, provides the same dividends as common/ordinary shareholders, and is registered

preferred, non-voting, exchangeable, participating, registered share
type: Class
subclass of: ExchangeablePreferredShare
subclass of: NonCumulativePreferredShare
subclass of: NonVotingShare
subclass of: ParticipatingPreferredShare
subclass of: PreferredShareWithFixedRateDividend
subclass of: RegisteredSecurity
definition: preferred share that confers zero votes per share, may be exchanged for securities of another issuer, provides a periodic stated income and participates with common shareholders in further dividend and capital distributions, and is registered

preferred, non-voting, extendable, adjustable income, registered share
type: Class
subclass of: ExtendablePreferredShare
subclass of: NonVotingShare
subclass of: PreferredShareWithAdjustableRateDividend
subclass of: RegisteredSecurity
subclass of: Class
  union of: RedeemablePreferredShareWithExtendableRedemptionDate
  union of: RetractablePreferredShareWithExtendableRedemptionDate
definition: preferred share that confers zero votes per share, may be redeemed at the option of the issuer and/or of the shareholder with an extendable redemption date, provides a periodic income whose dividend rate is set periodically, and is registered

preferred, non-voting, extendable, auction rate income, registered share
type: Class
subclass of: ExtendablePreferredShare
subclass of: NonVotingShare
subclass of: PreferredShareWithAuctionRateDividend
subclass of: RegisteredSecurity
subclass of: Class
  union of: RedeemablePreferredShareWithExtendableRedemptionDate
  union of: RetractablePreferredShareWithExtendableRedemptionDate
definition: preferred share that confers zero votes per share, may be redeemed at the option of the issuer and/or of the shareholder with an extendable redemption date, provides a periodic income whose dividend rate is adjusted through an auction, and is registered

preferred, non-voting, extendable, cumulative participating, registered share
type: Class
subclass of: CumulativePreferredShare
subclass of: ExtendablePreferredShare
subclass of: NonVotingShare
subclass of: ParticipatingPreferredShare
subclass of: PreferredShareWithFixedRateDividend
subclass of: RegisteredSecurity
subclass of: Class
  union of: RedeemablePreferredShareWithExtendableRedemptionDate
  union of: RetractablePreferredShareWithExtendableRedemptionDate
definition: preferred share that confers zero votes per share, may be redeemed at the option of the issuer and/or of the shareholder with an extendable redemption date, provides a periodic stated income, dividends not paid in any year accumulate, and participates with common shareholders in further dividend and capital distributions, and is registered

preferred, non-voting, extendable, cumulative, registered share
type: Class
subclass of: CumulativePreferredShare
subclass of: ExtendablePreferredShare
subclass of: NonParticipatingPreferredShare
subclass of: NonVotingShare
subclass of: PreferredShareWithFixedRateDividend
subclass of: RegisteredSecurity
subclass of: Class
  union of: RedeemablePreferredShareWithExtendableRedemptionDate
  union of: RetractablePreferredShareWithExtendableRedemptionDate
definition: preferred share that confers zero votes per share, may be redeemed at the option of the issuer and/or of the shareholder with an extendable redemption date, provides a periodic stated income and dividends not paid in any year accumulate, and is registered

preferred, non-voting, extendable, fixed income, registered share
type: Class
subclass of: ExtendablePreferredShare
subclass of: NonCumulativePreferredShare
subclass of: NonParticipatingPreferredShare
subclass of: NonVotingShare
subclass of: PreferredShareWithFixedRateDividend
subclass of: RegisteredSecurity
subclass of: Class
  union of: RedeemablePreferredShareWithExtendableRedemptionDate
  union of: RetractablePreferredShareWithExtendableRedemptionDate
definition: preferred share that confers zero votes per share, may be redeemed at the option of the issuer and/or of the shareholder with an extendable redemption date, provides a periodic stated income, and is registered

preferred, non-voting, extendable, normal income, registered share
type: Class
subclass of: ExtendablePreferredShare
subclass of: NonCumulativePreferredShare
subclass of: NonVotingShare
subclass of: RegisteredSecurity
subclass of: Class
  union of: RedeemablePreferredShareWithExtendableRedemptionDate
  union of: RetractablePreferredShareWithExtendableRedemptionDate
definition: preferred share that confers zero votes per share, may be redeemed at the option of the issuer and/or of the shareholder with an extendable redemption date, provides the same dividends as common/ordinary shareholders, and is registered

preferred, non-voting, extendable, participating, registered share
type: Class
subclass of: ExtendablePreferredShare
subclass of: NonCumulativePreferredShare
subclass of: NonVotingShare
subclass of: ParticipatingPreferredShare
subclass of: PreferredShareWithFixedRateDividend
subclass of: RegisteredSecurity
subclass of: Class
  union of: RedeemablePreferredShareWithExtendableRedemptionDate
  union of: RetractablePreferredShareWithExtendableRedemptionDate
definition: preferred share that confers zero votes per share, may be redeemed at the option of the issuer and/or of the shareholder with an extendable redemption date, provides a periodic stated income and participates with common shareholders in further dividend and capital distributions, and is registered

preferred, non-voting, perpetual, adjustable income, registered share
type: Class
subclass of: NonVotingShare
subclass of: PerpetualPreferredShare
subclass of: PreferredShareWithAdjustableRateDividend
subclass of: RegisteredSecurity
definition: preferred share that confers zero votes per share, has no fixed maturity date, provides a periodic income whose dividend rate is set periodically, and is registered

preferred, non-voting, perpetual, auction rate income, registered share
type: Class
subclass of: NonVotingShare
subclass of: PerpetualPreferredShare
subclass of: PreferredShareWithAuctionRateDividend
subclass of: RegisteredSecurity
definition: preferred share that confers zero votes per share, has no fixed maturity date, provides a periodic income whose dividend rate is adjusted through an auction, and is registered

preferred, non-voting, perpetual, cumulative participating, registered share
type: Class
subclass of: CumulativePreferredShare
subclass of: NonVotingShare
subclass of: ParticipatingPreferredShare
subclass of: PerpetualPreferredShare
subclass of: PreferredShareWithFixedRateDividend
subclass of: RegisteredSecurity
definition: preferred share that confers zero votes per share, has no fixed maturity date, provides a periodic stated income, dividends not paid in any year accumulate, and participates with common shareholders in further dividend and capital distributions, and is registered

preferred, non-voting, perpetual, cumulative, registered share
type: Class
subclass of: CumulativePreferredShare
subclass of: NonParticipatingPreferredShare
subclass of: NonVotingShare
subclass of: PerpetualPreferredShare
subclass of: PreferredShareWithFixedRateDividend
subclass of: RegisteredSecurity
definition: preferred share that confers zero votes per share, has no fixed maturity date, provides a periodic stated income and dividends not paid in any year accumulate, and is registered

preferred, non-voting, perpetual, fixed income, registered share
type: Class
subclass of: NonCumulativePreferredShare
subclass of: NonParticipatingPreferredShare
subclass of: NonVotingShare
subclass of: PerpetualPreferredShare
subclass of: PreferredShareWithFixedRateDividend
subclass of: RegisteredSecurity
definition: preferred share that confers zero votes per share, has no fixed maturity date, provides a periodic stated income, and is registered

preferred, non-voting, perpetual, normal income, registered share
type: Class
subclass of: NonCumulativePreferredShare
subclass of: NonVotingShare
subclass of: PerpetualPreferredShare
subclass of: RegisteredSecurity
definition: preferred share that confers zero votes per share, has no fixed maturity date, provides the same dividends as common/ordinary shareholders, and is registered

preferred, non-voting, perpetual, participating, registered share
type: Class
subclass of: NonCumulativePreferredShare
subclass of: NonVotingShare
subclass of: ParticipatingPreferredShare
subclass of: PerpetualPreferredShare
subclass of: PreferredShareWithFixedRateDividend
subclass of: RegisteredSecurity
definition: preferred share that confers zero votes per share, has no fixed maturity date, provides a periodic stated income and participates with common shareholders in further dividend and capital distributions, and is registered

preferred, non-voting, redeemable, adjustable income, registered share
type: Class
subclass of: NonVotingShare
subclass of: PreferredShareWithAdjustableRateDividend
subclass of: RegisteredSecurity
subclass of: Class
  union of: RedeemablePreferredShare
  union of: RetractablePreferredShare
definition: preferred share that confers zero votes per share, may be redeemed at the option of the issuer and/or of the shareholder, provides a periodic income whose dividend rate is set periodically, and is registered

preferred, non-voting, redeemable, auction rate income, registered share
type: Class
subclass of: NonVotingShare
subclass of: PreferredShareWithAuctionRateDividend
subclass of: RegisteredSecurity
subclass of: Class
  union of: RedeemablePreferredShare
  union of: RetractablePreferredShare
definition: preferred share that confers zero votes per share, may be redeemed at the option of the issuer and/or of the shareholder, provides a periodic income whose dividend rate is adjusted through an auction, and is registered

preferred, non-voting, redeemable, cumulative participating, registered share
type: Class
subclass of: CumulativePreferredShare
subclass of: NonVotingShare
subclass of: ParticipatingPreferredShare
subclass of: PreferredShareWithFixedRateDividend
subclass of: RegisteredSecurity
subclass of: Class
  union of: RedeemablePreferredShare
  union of: RetractablePreferredShare
definition: preferred share that confers zero votes per share, may be redeemed at the option of the issuer and/or of the shareholder, provides a periodic stated income, dividends not paid in any year accumulate, and participates with common shareholders in further dividend and capital distributions, and is registered

preferred, non-voting, redeemable, cumulative, registered share
type: Class
subclass of: CumulativePreferredShare
subclass of: NonParticipatingPreferredShare
subclass of: NonVotingShare
subclass of: PreferredShareWithFixedRateDividend
subclass of: RegisteredSecurity
subclass of: Class
  union of: RedeemablePreferredShare
  union of: RetractablePreferredShare
definition: preferred share that confers zero votes per share, may be redeemed at the option of the issuer and/or of the shareholder, provides a periodic stated income and dividends not paid in any year accumulate, and is registered

preferred, non-voting, redeemable exchangeable, adjustable income, registered share
type: Class
subclass of: ExchangeablePreferredShare
subclass of: NonVotingShare
subclass of: PreferredShareWithAdjustableRateDividend
subclass of: RegisteredSecurity
subclass of: Class
  union of: RedeemablePreferredShare
  union of: RetractablePreferredShare
definition: preferred share that confers zero votes per share, may be redeemed at the option of the issuer and/or of the shareholder, provides a periodic income whose dividend rate is set periodically, and is registered

preferred, non-voting, redeemable exchangeable, auction rate income, registered share
type: Class
subclass of: ExchangeablePreferredShare
subclass of: NonVotingShare
subclass of: PreferredShareWithAuctionRateDividend
subclass of: RegisteredSecurity
subclass of: Class
  union of: RedeemablePreferredShare
  union of: RetractablePreferredShare
definition: preferred share that confers zero votes per share, may be redeemed at the option of the issuer and/or of the shareholder, provides a periodic income whose dividend rate is adjusted through an auction, and is registered

preferred, non-voting, redeemable exchangeable, cumulative participating, registered share
type: Class
subclass of: CumulativePreferredShare
subclass of: ExchangeablePreferredShare
subclass of: NonVotingShare
subclass of: ParticipatingPreferredShare
subclass of: PreferredShareWithFixedRateDividend
subclass of: RegisteredSecurity
subclass of: Class
  union of: RedeemablePreferredShare
  union of: RetractablePreferredShare
definition: preferred share that confers zero votes per share, may be exchanged for securities of another issuer, may be redeemed at the option of the issuer and/or of the shareholder, provides a periodic stated income, dividends not paid in any year accumulate, and participates with common shareholders in further dividend and capital distributions, and is registered

preferred, non-voting, redeemable exchangeable, cumulative, registered share
type: Class
subclass of: CumulativePreferredShare
subclass of: ExchangeablePreferredShare
subclass of: NonParticipatingPreferredShare
subclass of: NonVotingShare
subclass of: PreferredShareWithFixedRateDividend
subclass of: RegisteredSecurity
subclass of: Class
  union of: RedeemablePreferredShare
  union of: RetractablePreferredShare
definition: preferred share that confers zero votes per share, may be exchanged for securities of another issuer, may be redeemed at the option of the issuer and/or of the shareholder, provides a periodic stated income and dividends not paid in any year accumulate, and is registered

preferred, non-voting, redeemable/exchangeable/extendable, adjustable income, registered share
type: Class
subclass of: ExchangeablePreferredShare
subclass of: ExtendablePreferredShare
subclass of: NonVotingShare
subclass of: PreferredShareWithAdjustableRateDividend
subclass of: RegisteredSecurity
subclass of: Class
  union of: RedeemablePreferredShareWithExtendableMaturityDate
  union of: RetractablePreferredShareWithExtendableMaturityDate
definition: preferred share that confers zero votes per share, may be exchanged for securities of another issuer, whose issuer and/or shareholders have the option to extend the maturity date, that provides a periodic income whose dividend rate is set periodically, and is registered

preferred, non-voting, redeemable/exchangeable/extendable, auction rate income, registered share
type: Class
subclass of: ExchangeablePreferredShare
subclass of: ExtendablePreferredShare
subclass of: NonVotingShare
subclass of: PreferredShareWithAuctionRateDividend
subclass of: RegisteredSecurity
subclass of: Class
  union of: RedeemablePreferredShareWithExtendableMaturityDate
  union of: RetractablePreferredShareWithExtendableMaturityDate
definition: preferred share that confers zero votes per share, may be exchanged for securities of another issuer, whose issuer and/or shareholders have the option to extend the maturity date, that provides a periodic income whose dividend rate is adjusted through an auction, and is registered

preferred, non-voting, redeemable/exchangeable/extendable, cumulative participating, registered share
type: Class
subclass of: CumulativePreferredShare
subclass of: ExchangeablePreferredShare
subclass of: ExtendablePreferredShare
subclass of: NonVotingShare
subclass of: ParticipatingPreferredShare
subclass of: PreferredShareWithFixedRateDividend
subclass of: RegisteredSecurity
subclass of: Class
  union of: RedeemablePreferredShareWithExtendableMaturityDate
  union of: RetractablePreferredShareWithExtendableMaturityDate
definition: preferred share that confers zero votes per share, may be exchanged for securities of another issuer, whose issuer and/or shareholders have the option to extend the maturity date, that provides a periodic stated income, dividends not paid in any year accumulate, and participates with common shareholders in further dividend and capital distributions, and is registered

preferred, non-voting, redeemable/exchangeable/extendable, cumulative, registered share
type: Class
subclass of: CumulativePreferredShare
subclass of: ExchangeablePreferredShare
subclass of: ExtendablePreferredShare
subclass of: NonParticipatingPreferredShare
subclass of: NonVotingShare
subclass of: PreferredShareWithFixedRateDividend
subclass of: RegisteredSecurity
subclass of: Class
  union of: RedeemablePreferredShareWithExtendableMaturityDate
  union of: RetractablePreferredShareWithExtendableMaturityDate
definition: preferred share that confers zero votes per share, may be exchanged for securities of another issuer, whose issuer and/or shareholders have the option to extend the maturity date, that provides a periodic stated income and dividends not paid in any year accumulate, and is registered

preferred, non-voting, redeemable/exchangeable/extendable, fixed income, registered share
type: Class
subclass of: ExchangeablePreferredShare
subclass of: ExtendablePreferredShare
subclass of: NonCumulativePreferredShare
subclass of: NonParticipatingPreferredShare
subclass of: NonVotingShare
subclass of: PreferredShareWithFixedRateDividend
subclass of: RegisteredSecurity
subclass of: Class
  union of: RedeemablePreferredShareWithExtendableMaturityDate
  union of: RetractablePreferredShareWithExtendableMaturityDate
definition: preferred share that confers zero votes per share, may be exchanged for securities of another issuer, whose issuer and/or shareholders have the option to extend the maturity date, that provides a periodic stated income, and is registered

preferred, non-voting, redeemable/exchangeable/extendable, normal income, registered share
type: Class
subclass of: ExchangeablePreferredShare
subclass of: ExtendablePreferredShare
subclass of: NonCumulativePreferredShare
subclass of: NonVotingShare
subclass of: RegisteredSecurity
subclass of: Class
  union of: RedeemablePreferredShareWithExtendableMaturityDate
  union of: RetractablePreferredShareWithExtendableMaturityDate
definition: preferred share that confers zero votes per share, may be exchanged for securities of another issuer, whose issuer and/or shareholders have the option to extend the maturity date, that provides the same dividends as common/ordinary shareholders, and is registered

preferred, non-voting, redeemable/exchangeable/extendable, participating, registered share
type: Class
subclass of: ExchangeablePreferredShare
subclass of: ExtendablePreferredShare
subclass of: NonCumulativePreferredShare
subclass of: NonVotingShare
subclass of: ParticipatingPreferredShare
subclass of: PreferredShareWithFixedRateDividend
subclass of: RegisteredSecurity
subclass of: Class
  union of: RedeemablePreferredShareWithExtendableMaturityDate
  union of: RetractablePreferredShareWithExtendableMaturityDate
definition: preferred share that confers zero votes per share, may be exchanged for securities of another issuer, whose issuer and/or shareholders have the option to extend the maturity date, that provides a periodic stated income and participates with common shareholders in further dividend and capital distributions, and is registered

preferred, non-voting, redeemable exchangeable, fixed income, registered share
type: Class
subclass of: ExchangeablePreferredShare
subclass of: NonCumulativePreferredShare
subclass of: NonParticipatingPreferredShare
subclass of: NonVotingShare
subclass of: PreferredShareWithFixedRateDividend
subclass of: RegisteredSecurity
subclass of: Class
  union of: RedeemablePreferredShare
  union of: RetractablePreferredShare
definition: preferred share that confers zero votes per share, may be exchanged for securities of another issuer, may be redeemed at the option of the issuer and/or of the shareholder, provides a periodic stated income, and is registered

preferred, non-voting, redeemable exchangeable, normal income, registered share
type: Class
subclass of: ExchangeablePreferredShare
subclass of: NonVotingShare
subclass of: RegisteredSecurity
subclass of: Class
  union of: RedeemablePreferredShare
  union of: RetractablePreferredShare
definition: preferred share that confers zero votes per share, may be exchanged for securities of another issuer, may be redeemed at the option of the issuer and/or of the shareholder, provides the same dividends as common/ordinary shareholders, and is registered

preferred, non-voting, redeemable exchangeable, participating, registered share
type: Class
subclass of: ExchangeablePreferredShare
subclass of: NonCumulativePreferredShare
subclass of: NonVotingShare
subclass of: ParticipatingPreferredShare
subclass of: PreferredShareWithFixedRateDividend
subclass of: RegisteredSecurity
subclass of: Class
  union of: RedeemablePreferredShare
  union of: RetractablePreferredShare
definition: preferred share that confers zero votes per share, may be exchanged for securities of another issuer, may be redeemed at the option of the issuer and/or of the shareholder, provides a periodic stated income and participates with common shareholders in further dividend and capital distributions, and is registered

preferred, non-voting, redeemable extendable, adjustable income, registered share
type: Class
subclass of: ExtendablePreferredShare
subclass of: NonVotingShare
subclass of: PreferredShareWithAdjustableRateDividend
subclass of: RegisteredSecurity
subclass of: Class
  union of: RedeemablePreferredShareWithExtendableMaturityDate
  union of: RetractablePreferredShareWithExtendableMaturityDate
definition: preferred share that confers zero votes per share, whose issuer and/or shareholders have the option to extend the maturity date, that provides a periodic income whose dividend rate is set periodically, and is registered

preferred, non-voting, redeemable extendable, auction rate income, registered share
type: Class
subclass of: ExtendablePreferredShare
subclass of: NonVotingShare
subclass of: PreferredShareWithAuctionRateDividend
subclass of: RegisteredSecurity
subclass of: Class
  union of: RedeemablePreferredShareWithExtendableMaturityDate
  union of: RetractablePreferredShareWithExtendableMaturityDate
definition: preferred share that confers zero votes per share, whose issuer and/or shareholders have the option to extend the maturity date, that provides a periodic income whose dividend rate is adjusted through an auction, and is registered

preferred, non-voting, redeemable extendable, cumulative participating, registered share
type: Class
subclass of: CumulativePreferredShare
subclass of: ExtendablePreferredShare
subclass of: NonVotingShare
subclass of: ParticipatingPreferredShare
subclass of: PreferredShareWithFixedRateDividend
subclass of: RegisteredSecurity
subclass of: Class
  union of: RedeemablePreferredShareWithExtendableMaturityDate
  union of: RetractablePreferredShareWithExtendableMaturityDate
definition: preferred share that confers zero votes per share, whose issuer and/or shareholders have the option to extend the maturity date, that provides a periodic stated income, dividends not paid in any year accumulate, and participates with common shareholders in further dividend and capital distributions, and is registered

preferred, non-voting, redeemable extendable, cumulative, registered share
type: Class
subclass of: CumulativePreferredShare
subclass of: ExtendablePreferredShare
subclass of: NonParticipatingPreferredShare
subclass of: NonVotingShare
subclass of: PreferredShareWithFixedRateDividend
subclass of: RegisteredSecurity
subclass of: Class
  union of: RedeemablePreferredShareWithExtendableMaturityDate
  union of: RetractablePreferredShareWithExtendableMaturityDate
definition: preferred share that confers zero votes per share, whose issuer and/or shareholders have the option to extend the maturity date, that provides a periodic stated income and dividends not paid in any year accumulate, and is registered

preferred, non-voting, redeemable extendable, fixed income, registered share
type: Class
subclass of: ExtendablePreferredShare
subclass of: NonCumulativePreferredShare
subclass of: NonParticipatingPreferredShare
subclass of: NonVotingShare
subclass of: PreferredShareWithFixedRateDividend
subclass of: RegisteredSecurity
subclass of: Class
  union of: RedeemablePreferredShareWithExtendableMaturityDate
  union of: RetractablePreferredShareWithExtendableMaturityDate
definition: preferred share that confers zero votes per share, whose issuer and/or shareholders have the option to extend the maturity date, that provides a periodic stated income, and is registered

preferred, non-voting, redeemable extendable, normal income, registered share
type: Class
subclass of: ExtendablePreferredShare
subclass of: NonVotingShare
subclass of: RegisteredSecurity
subclass of: Class
  union of: RedeemablePreferredShareWithExtendableMaturityDate
  union of: RetractablePreferredShareWithExtendableMaturityDate
definition: preferred share that confers zero votes per share, whose issuer and/or shareholders have the option to extend the maturity date, that provides the same dividends as common/ordinary shareholders, and is registered

preferred, non-voting, redeemable extendable, participating, registered share
type: Class
subclass of: ExtendablePreferredShare
subclass of: NonCumulativePreferredShare
subclass of: NonVotingShare
subclass of: ParticipatingPreferredShare
subclass of: PreferredShareWithFixedRateDividend
subclass of: RegisteredSecurity
subclass of: Class
  union of: RedeemablePreferredShareWithExtendableMaturityDate
  union of: RetractablePreferredShareWithExtendableMaturityDate
definition: preferred share that confers zero votes per share, whose issuer and/or shareholders have the option to extend the maturity date, that provides a periodic stated income and participates with common shareholders in further dividend and capital distributions, and is registered

preferred, non-voting, redeemable, fixed income, registered share
type: Class
subclass of: NonCumulativePreferredShare
subclass of: NonParticipatingPreferredShare
subclass of: NonVotingShare
subclass of: PreferredShareWithFixedRateDividend
subclass of: RegisteredSecurity
subclass of: Class
  union of: RedeemablePreferredShare
  union of: RetractablePreferredShare
definition: preferred share that confers zero votes per share, may be redeemed at the option of the issuer and/or of the shareholder, provides a periodic stated income, and is registered

preferred, non-voting, redeemable, normal income, registered share
type: Class
subclass of: NonVotingShare
subclass of: RegisteredSecurity
subclass of: Class
  union of: RedeemablePreferredShare
  union of: RetractablePreferredShare
definition: preferred share that confers zero votes per share, may be redeemed at the option of the issuer and/or of the shareholder, provides the same dividends as common/ordinary shareholders, and is registered

preferred, non-voting, redeemable, participating, registered share
type: Class
subclass of: NonCumulativePreferredShare
subclass of: NonVotingShare
subclass of: ParticipatingPreferredShare
subclass of: PreferredShareWithFixedRateDividend
subclass of: RegisteredSecurity
subclass of: Class
  union of: RedeemablePreferredShare
  union of: RetractablePreferredShare
definition: preferred share that confers zero votes per share, may be redeemed at the option of the issuer and/or of the shareholder, provides a periodic stated income and participates with common shareholders in further dividend and capital distributions, and is registered

preferred, restricted voting, exchangeable, adjustable income, registered share
type: Class
subclass of: ExchangeablePreferredShare
subclass of: PreferredShareWithAdjustableRateDividend
subclass of: RestrictedVotingShare
subclass of: RegisteredSecurity
definition: preferred share that confers less than one vote per share, may be exchanged for securities of another issuer, provides a periodic income whose dividend rate is set periodically, and is registered

preferred, restricted voting, exchangeable, auction rate income, registered share
type: Class
subclass of: ExchangeablePreferredShare
subclass of: PreferredShareWithAuctionRateDividend
subclass of: RestrictedVotingShare
subclass of: RegisteredSecurity
definition: preferred share that confers less than one vote per share, may be exchanged for securities of another issuer, provides a periodic income whose dividend rate is adjusted through an auction, and is registered

preferred, restricted voting, exchangeable, cumulative participating, registered share
type: Class
subclass of: CumulativePreferredShare
subclass of: ExchangeablePreferredShare
subclass of: ParticipatingPreferredShare
subclass of: PreferredShareWithFixedRateDividend
subclass of: RestrictedVotingShare
subclass of: RegisteredSecurity
definition: preferred share that confers less than one vote per share, may be exchanged for securities of another issuer, provides a periodic stated income, dividends not paid in any year accumulate, and participates with common shareholders in further dividend and capital distributions, and is registered

preferred, restricted voting, exchangeable, cumulative, registered share
type: Class
subclass of: CumulativePreferredShare
subclass of: ExchangeablePreferredShare
subclass of: NonParticipatingPreferredShare
subclass of: PreferredShareWithFixedRateDividend
subclass of: RestrictedVotingShare
subclass of: RegisteredSecurity
definition: preferred share that confers less than one vote per share, may be exchanged for securities of another issuer, provides a periodic stated income and dividends not paid in any year accumulate, and is registered

preferred, restricted voting, exchangeable, fixed income, registered share
type: Class
subclass of: ExchangeablePreferredShare
subclass of: NonCumulativePreferredShare
subclass of: NonParticipatingPreferredShare
subclass of: PreferredShareWithFixedRateDividend
subclass of: RestrictedVotingShare
subclass of: RegisteredSecurity
definition: preferred share that confers less than one vote per share, may be exchanged for securities of another issuer, provides a periodic stated income, and is registered

preferred, restricted voting, exchangeable, normal income, registered share
type: Class
subclass of: ExchangeablePreferredShare
subclass of: NonCumulativePreferredShare
subclass of: RestrictedVotingShare
subclass of: RegisteredSecurity
definition: preferred share that confers less than one vote per share, may be exchanged for securities of another issuer, provides the same dividends as common/ordinary shareholders, and is registered

preferred, restricted voting, exchangeable, participating, registered share
type: Class
subclass of: ExchangeablePreferredShare
subclass of: NonCumulativePreferredShare
subclass of: ParticipatingPreferredShare
subclass of: PreferredShareWithFixedRateDividend
subclass of: RestrictedVotingShare
subclass of: RegisteredSecurity
definition: preferred share that confers less than one vote per share, may be exchanged for securities of another issuer, provides a periodic stated income and participates with common shareholders in further dividend and capital distributions, and is registered

preferred, restricted voting, extendable, adjustable income, registered share
type: Class
subclass of: ExtendablePreferredShare
subclass of: PreferredShareWithAdjustableRateDividend
subclass of: RestrictedVotingShare
subclass of: RegisteredSecurity
subclass of: Class
  union of: RedeemablePreferredShareWithExtendableRedemptionDate
  union of: RetractablePreferredShareWithExtendableRedemptionDate
definition: preferred share that confers less than one vote per share, may be redeemed at the option of the issuer and/or of the shareholder with an extendable redemption date, provides a periodic income whose dividend rate is set periodically, and is registered

preferred, restricted voting, extendable, auction rate income, registered share
type: Class
subclass of: ExtendablePreferredShare
subclass of: PreferredShareWithAuctionRateDividend
subclass of: RestrictedVotingShare
subclass of: RegisteredSecurity
subclass of: Class
  union of: RedeemablePreferredShareWithExtendableRedemptionDate
  union of: RetractablePreferredShareWithExtendableRedemptionDate
definition: preferred share that confers less than one vote per share, may be redeemed at the option of the issuer and/or of the shareholder with an extendable redemption date, provides a periodic income whose dividend rate is adjusted through an auction, and is registered

preferred, restricted voting, extendable, cumulative participating, registered share
type: Class
subclass of: CumulativePreferredShare
subclass of: ExtendablePreferredShare
subclass of: ParticipatingPreferredShare
subclass of: PreferredShareWithFixedRateDividend
subclass of: RestrictedVotingShare
subclass of: RegisteredSecurity
subclass of: Class
  union of: RedeemablePreferredShareWithExtendableRedemptionDate
  union of: RetractablePreferredShareWithExtendableRedemptionDate
definition: preferred share that confers less than one vote per share, may be redeemed at the option of the issuer and/or of the shareholder with an extendable redemption date, provides a periodic stated income, dividends not paid in any year accumulate, and participates with common shareholders in further dividend and capital distributions, and is registered

preferred, restricted voting, extendable, cumulative, registered share
type: Class
subclass of: CumulativePreferredShare
subclass of: ExtendablePreferredShare
subclass of: NonParticipatingPreferredShare
subclass of: PreferredShareWithFixedRateDividend
subclass of: RestrictedVotingShare
subclass of: RegisteredSecurity
subclass of: Class
  union of: RedeemablePreferredShareWithExtendableRedemptionDate
  union of: RetractablePreferredShareWithExtendableRedemptionDate
definition: preferred share that confers less than one vote per share, may be redeemed at the option of the issuer and/or of the shareholder with an extendable redemption date, provides a periodic stated income and dividends not paid in any year accumulate, and is registered

preferred, restricted voting, extendable, fixed income, registered share
type: Class
subclass of: ExtendablePreferredShare
subclass of: NonCumulativePreferredShare
subclass of: NonParticipatingPreferredShare
subclass of: PreferredShareWithFixedRateDividend
subclass of: RestrictedVotingShare
subclass of: RegisteredSecurity
subclass of: Class
  union of: RedeemablePreferredShareWithExtendableRedemptionDate
  union of: RetractablePreferredShareWithExtendableRedemptionDate
definition: preferred share that confers less than one vote per share, may be redeemed at the option of the issuer and/or of the shareholder with an extendable redemption date, provides a periodic stated income, and is registered

preferred, restricted voting, extendable, normal income, registered share
type: Class
subclass of: ExtendablePreferredShare
subclass of: NonCumulativePreferredShare
subclass of: RestrictedVotingShare
subclass of: RegisteredSecurity
subclass of: Class
  union of: RedeemablePreferredShareWithExtendableRedemptionDate
  union of: RetractablePreferredShareWithExtendableRedemptionDate
definition: preferred share that confers less than one vote per share, may be redeemed at the option of the issuer and/or of the shareholder with an extendable redemption date, provides the same dividends as common/ordinary shareholders, and is registered

preferred, restricted voting, extendable, participating, registered share
type: Class
subclass of: ExtendablePreferredShare
subclass of: NonCumulativePreferredShare
subclass of: ParticipatingPreferredShare
subclass of: PreferredShareWithFixedRateDividend
subclass of: RestrictedVotingShare
subclass of: RegisteredSecurity
subclass of: Class
  union of: RedeemablePreferredShareWithExtendableRedemptionDate
  union of: RetractablePreferredShareWithExtendableRedemptionDate
definition: preferred share that confers less than one vote per share, may be redeemed at the option of the issuer and/or of the shareholder with an extendable redemption date, provides a periodic stated income and participates with common shareholders in further dividend and capital distributions, and is registered

preferred, restricted voting, perpetual, adjustable income, registered share
type: Class
subclass of: PerpetualPreferredShare
subclass of: PreferredShareWithAdjustableRateDividend
subclass of: RestrictedVotingShare
subclass of: RegisteredSecurity
definition: preferred share that confers less than one vote per share, has no fixed maturity date, provides a periodic income whose dividend rate is set periodically, and is registered

preferred, restricted voting, perpetual, auction rate income, registered share
type: Class
subclass of: PerpetualPreferredShare
subclass of: PreferredShareWithAuctionRateDividend
subclass of: RestrictedVotingShare
subclass of: RegisteredSecurity
definition: preferred share that confers less than one vote per share, has no fixed maturity date, provides a periodic income whose dividend rate is adjusted through an auction, and is registered

preferred, restricted voting, perpetual, cumulative participating, registered share
type: Class
subclass of: CumulativePreferredShare
subclass of: ParticipatingPreferredShare
subclass of: PerpetualPreferredShare
subclass of: PreferredShareWithFixedRateDividend
subclass of: RestrictedVotingShare
subclass of: RegisteredSecurity
definition: preferred share that confers less than one vote per share, has no fixed maturity date, provides a periodic stated income, dividends not paid in any year accumulate, and participates with common shareholders in further dividend and capital distributions, and is registered

preferred, restricted voting, perpetual, cumulative, registered share
type: Class
subclass of: CumulativePreferredShare
subclass of: NonParticipatingPreferredShare
subclass of: PerpetualPreferredShare
subclass of: PreferredShareWithFixedRateDividend
subclass of: RestrictedVotingShare
subclass of: RegisteredSecurity
definition: preferred share that confers less than one vote per share, has no fixed maturity date, provides a periodic stated income and dividends not paid in any year accumulate, and is registered

preferred, restricted voting, perpetual, fixed income, registered share
type: Class
subclass of: NonCumulativePreferredShare
subclass of: NonParticipatingPreferredShare
subclass of: PerpetualPreferredShare
subclass of: PreferredShareWithFixedRateDividend
subclass of: RestrictedVotingShare
subclass of: RegisteredSecurity
definition: preferred share that confers less than one vote per share, has no fixed maturity date, provides a periodic stated income, and is registered

preferred, restricted voting, perpetual, normal income, registered share
type: Class
subclass of: NonCumulativePreferredShare
subclass of: PerpetualPreferredShare
subclass of: RestrictedVotingShare
subclass of: RegisteredSecurity
definition: preferred share that confers less than one vote per share, has no fixed maturity date, provides the same dividends as common/ordinary shareholders, and is registered

preferred, restricted voting, perpetual, participating, registered share
type: Class
subclass of: NonCumulativePreferredShare
subclass of: ParticipatingPreferredShare
subclass of: PerpetualPreferredShare
subclass of: PreferredShareWithFixedRateDividend
subclass of: RestrictedVotingShare
subclass of: RegisteredSecurity
definition: preferred share that confers less than one vote per share, has no fixed maturity date, provides a periodic stated income and participates with common shareholders in further dividend and capital distributions, and is registered

preferred, restricted voting, redeemable, adjustable income, registered share
type: Class
subclass of: PreferredShareWithAdjustableRateDividend
subclass of: RestrictedVotingShare
subclass of: RegisteredSecurity
subclass of: Class
  union of: RedeemablePreferredShare
  union of: RetractablePreferredShare
definition: preferred share that confers less than one vote per share, may be redeemed at the option of the issuer and/or of the shareholder, provides a periodic income whose dividend rate is set periodically, and is registered

preferred, restricted voting, redeemable, auction rate income, registered share
type: Class
subclass of: PreferredShareWithAuctionRateDividend
subclass of: RestrictedVotingShare
subclass of: RegisteredSecurity
subclass of: Class
  union of: RedeemablePreferredShare
  union of: RetractablePreferredShare
definition: preferred share that confers less than one vote per share, may be redeemed at the option of the issuer and/or of the shareholder, provides a periodic income whose dividend rate is adjusted through an auction, and is registered

preferred, restricted voting, redeemable, cumulative participating, registered share
type: Class
subclass of: CumulativePreferredShare
subclass of: ParticipatingPreferredShare
subclass of: PreferredShareWithFixedRateDividend
subclass of: RestrictedVotingShare
subclass of: RegisteredSecurity
subclass of: Class
  union of: RedeemablePreferredShare
  union of: RetractablePreferredShare
definition: preferred share that confers less than one vote per share, may be redeemed at the option of the issuer and/or of the shareholder, provides a periodic stated income, dividends not paid in any year accumulate, and participates with common shareholders in further dividend and capital distributions, and is registered

preferred, restricted voting, redeemable, cumulative, registered share
type: Class
subclass of: CumulativePreferredShare
subclass of: NonParticipatingPreferredShare
subclass of: PreferredShareWithFixedRateDividend
subclass of: RestrictedVotingShare
subclass of: RegisteredSecurity
subclass of: Class
  union of: RedeemablePreferredShare
  union of: RetractablePreferredShare
definition: preferred share that confers less than one vote per share, may be redeemed at the option of the issuer and/or of the shareholder, provides a periodic stated income and dividends not paid in any year accumulate, and is registered

preferred, restricted voting, redeemable exchangeable, adjustable income, registered share
type: Class
subclass of: ExchangeablePreferredShare
subclass of: PreferredShareWithAdjustableRateDividend
subclass of: RestrictedVotingShare
subclass of: RegisteredSecurity
subclass of: Class
  union of: RedeemablePreferredShare
  union of: RetractablePreferredShare
definition: preferred share that confers less than one vote per share, may be redeemed at the option of the issuer and/or of the shareholder, provides a periodic income whose dividend rate is set periodically, and is registered

preferred, restricted voting, redeemable exchangeable, auction rate income, registered share
type: Class
subclass of: ExchangeablePreferredShare
subclass of: PreferredShareWithAuctionRateDividend
subclass of: RestrictedVotingShare
subclass of: RegisteredSecurity
subclass of: Class
  union of: RedeemablePreferredShare
  union of: RetractablePreferredShare
definition: preferred share that confers less than one vote per share, may be redeemed at the option of the issuer and/or of the shareholder, provides a periodic income whose dividend rate is adjusted through an auction, and is registered

preferred, restricted voting, redeemable exchangeable, cumulative participating, registered share
type: Class
subclass of: CumulativePreferredShare
subclass of: ExchangeablePreferredShare
subclass of: ParticipatingPreferredShare
subclass of: PreferredShareWithFixedRateDividend
subclass of: RestrictedVotingShare
subclass of: RegisteredSecurity
subclass of: Class
  union of: RedeemablePreferredShare
  union of: RetractablePreferredShare
definition: preferred share that confers less than one vote per share, may be exchanged for securities of another issuer, may be redeemed at the option of the issuer and/or of the shareholder, provides a periodic stated income, dividends not paid in any year accumulate, and participates with common shareholders in further dividend and capital distributions, and is registered

preferred, restricted voting, redeemable exchangeable, cumulative, registered share
type: Class
subclass of: CumulativePreferredShare
subclass of: ExchangeablePreferredShare
subclass of: NonParticipatingPreferredShare
subclass of: PreferredShareWithFixedRateDividend
subclass of: RestrictedVotingShare
subclass of: RegisteredSecurity
subclass of: Class
  union of: RedeemablePreferredShare
  union of: RetractablePreferredShare
definition: preferred share that confers less than one vote per share, may be exchanged for securities of another issuer, may be redeemed at the option of the issuer and/or of the shareholder, provides a periodic stated income and dividends not paid in any year accumulate, and is registered

preferred, restricted voting, redeemable/exchangeable/extendable, adjustable income, registered share
type: Class
subclass of: ExchangeablePreferredShare
subclass of: ExtendablePreferredShare
subclass of: PreferredShareWithAdjustableRateDividend
subclass of: RestrictedVotingShare
subclass of: RegisteredSecurity
subclass of: Class
  union of: RedeemablePreferredShareWithExtendableMaturityDate
  union of: RetractablePreferredShareWithExtendableMaturityDate
definition: preferred share that confers less than one vote per share, may be exchanged for securities of another issuer, whose issuer and/or shareholders have the option to extend the maturity date, that provides a periodic income whose dividend rate is set periodically, and is registered

preferred, restricted voting, redeemable/exchangeable/extendable, auction rate income, registered share
type: Class
subclass of: ExchangeablePreferredShare
subclass of: ExtendablePreferredShare
subclass of: PreferredShareWithAuctionRateDividend
subclass of: RestrictedVotingShare
subclass of: RegisteredSecurity
subclass of: Class
  union of: RedeemablePreferredShareWithExtendableMaturityDate
  union of: RetractablePreferredShareWithExtendableMaturityDate
definition: preferred share that confers less than one vote per share, may be exchanged for securities of another issuer, whose issuer and/or shareholders have the option to extend the maturity date, that provides a periodic income whose dividend rate is adjusted through an auction, and is registered

preferred, restricted voting, redeemable/exchangeable/extendable, cumulative participating, registered share
type: Class
subclass of: CumulativePreferredShare
subclass of: ExchangeablePreferredShare
subclass of: ExtendablePreferredShare
subclass of: ParticipatingPreferredShare
subclass of: PreferredShareWithFixedRateDividend
subclass of: RestrictedVotingShare
subclass of: RegisteredSecurity
subclass of: Class
  union of: RedeemablePreferredShareWithExtendableMaturityDate
  union of: RetractablePreferredShareWithExtendableMaturityDate
definition: preferred share that confers less than one vote per share, may be exchanged for securities of another issuer, whose issuer and/or shareholders have the option to extend the maturity date, that provides a periodic stated income, dividends not paid in any year accumulate, and participates with common shareholders in further dividend and capital distributions, and is registered

preferred, restricted voting, redeemable/exchangeable/extendable, cumulative, registered share
type: Class
subclass of: CumulativePreferredShare
subclass of: ExchangeablePreferredShare
subclass of: ExtendablePreferredShare
subclass of: NonParticipatingPreferredShare
subclass of: PreferredShareWithFixedRateDividend
subclass of: RestrictedVotingShare
subclass of: RegisteredSecurity
subclass of: Class
  union of: RedeemablePreferredShareWithExtendableMaturityDate
  union of: RetractablePreferredShareWithExtendableMaturityDate
definition: preferred share that confers less than one vote per share, may be exchanged for securities of another issuer, whose issuer and/or shareholders have the option to extend the maturity date, that provides a periodic stated income and dividends not paid in any year accumulate, and is registered

preferred, restricted voting, redeemable/exchangeable/extendable, fixed income, registered share
type: Class
subclass of: ExchangeablePreferredShare
subclass of: ExtendablePreferredShare
subclass of: NonCumulativePreferredShare
subclass of: NonParticipatingPreferredShare
subclass of: PreferredShareWithFixedRateDividend
subclass of: RestrictedVotingShare
subclass of: RegisteredSecurity
subclass of: Class
  union of: RedeemablePreferredShareWithExtendableMaturityDate
  union of: RetractablePreferredShareWithExtendableMaturityDate
definition: preferred share that confers less than one vote per share, may be exchanged for securities of another issuer, whose issuer and/or shareholders have the option to extend the maturity date, that provides a periodic stated income, and is registered

preferred, restricted voting, redeemable/exchangeable/extendable, normal income, registered share
type: Class
subclass of: ExchangeablePreferredShare
subclass of: ExtendablePreferredShare
subclass of: NonCumulativePreferredShare
subclass of: RestrictedVotingShare
subclass of: RegisteredSecurity
subclass of: Class
  union of: RedeemablePreferredShareWithExtendableMaturityDate
  union of: RetractablePreferredShareWithExtendableMaturityDate
definition: preferred share that confers less than one vote per share, may be exchanged for securities of another issuer, whose issuer and/or shareholders have the option to extend the maturity date, that provides the same dividends as common/ordinary shareholders, and is registered

preferred, restricted voting, redeemable/exchangeable/extendable, participating, registered share
type: Class
subclass of: ExchangeablePreferredShare
subclass of: ExtendablePreferredShare
subclass of: NonCumulativePreferredShare
subclass of: ParticipatingPreferredShare
subclass of: PreferredShareWithFixedRateDividend
subclass of: RestrictedVotingShare
subclass of: RegisteredSecurity
subclass of: Class
  union of: RedeemablePreferredShareWithExtendableMaturityDate
  union of: RetractablePreferredShareWithExtendableMaturityDate
definition: preferred share that confers less than one vote per share, may be exchanged for securities of another issuer, whose issuer and/or shareholders have the option to extend the maturity date, that provides a periodic stated income and participates with common shareholders in further dividend and capital distributions, and is registered

preferred, restricted voting, redeemable exchangeable, fixed income, registered share
type: Class
subclass of: ExchangeablePreferredShare
subclass of: NonCumulativePreferredShare
subclass of: NonParticipatingPreferredShare
subclass of: PreferredShareWithFixedRateDividend
subclass of: RestrictedVotingShare
subclass of: RegisteredSecurity
subclass of: Class
  union of: RedeemablePreferredShare
  union of: RetractablePreferredShare
definition: preferred share that confers less than one vote per share, may be exchanged for securities of another issuer, may be redeemed at the option of the issuer and/or of the shareholder, provides a periodic stated income, and is registered

preferred, restricted voting, redeemable exchangeable, normal income, registered share
type: Class
subclass of: ExchangeablePreferredShare
subclass of: RestrictedVotingShare
subclass of: RegisteredSecurity
subclass of: Class
  union of: RedeemablePreferredShare
  union of: RetractablePreferredShare
definition: preferred share that confers less than one vote per share, may be exchanged for securities of another issuer, may be redeemed at the option of the issuer and/or of the shareholder, provides the same dividends as common/ordinary shareholders, and is registered

preferred, restricted voting, redeemable exchangeable, participating, registered share
type: Class
subclass of: ExchangeablePreferredShare
subclass of: NonCumulativePreferredShare
subclass of: ParticipatingPreferredShare
subclass of: PreferredShareWithFixedRateDividend
subclass of: RestrictedVotingShare
subclass of: RegisteredSecurity
subclass of: Class
  union of: RedeemablePreferredShare
  union of: RetractablePreferredShare
definition: preferred share that confers less than one per share, may be exchanged for securities of another issuer, may be redeemed at the option of the issuer and/or of the shareholder, provides a periodic stated income and participates with common shareholders in further dividend and capital distributions, and is registered

preferred, restricted voting, redeemable extendable, adjustable income, registered share
type: Class
subclass of: ExtendablePreferredShare
subclass of: PreferredShareWithAdjustableRateDividend
subclass of: RestrictedVotingShare
subclass of: RegisteredSecurity
subclass of: Class
  union of: RedeemablePreferredShareWithExtendableMaturityDate
  union of: RetractablePreferredShareWithExtendableMaturityDate
definition: preferred share that confers less than one vote per share, whose issuer and/or shareholders have the option to extend the maturity date, that provides a periodic income whose dividend rate is set periodically, and is registered

preferred, restricted voting, redeemable extendable, auction rate income, registered share
type: Class
subclass of: ExtendablePreferredShare
subclass of: PreferredShareWithAuctionRateDividend
subclass of: RestrictedVotingShare
subclass of: RegisteredSecurity
subclass of: Class
  union of: RedeemablePreferredShareWithExtendableMaturityDate
  union of: RetractablePreferredShareWithExtendableMaturityDate
definition: preferred share that confers less than one vote per share, whose issuer and/or shareholders have the option to extend the maturity date, that provides a periodic income whose dividend rate is adjusted through an auction, and is registered

preferred, restricted voting, redeemable extendable, cumulative participating, registered share
type: Class
subclass of: CumulativePreferredShare
subclass of: ExtendablePreferredShare
subclass of: ParticipatingPreferredShare
subclass of: PreferredShareWithFixedRateDividend
subclass of: RestrictedVotingShare
subclass of: RegisteredSecurity
subclass of: Class
  union of: RedeemablePreferredShareWithExtendableMaturityDate
  union of: RetractablePreferredShareWithExtendableMaturityDate
definition: preferred share that confers less than one vote per share, whose issuer and/or shareholders have the option to extend the maturity date, that provides a periodic stated income, dividends not paid in any year accumulate, and participates with common shareholders in further dividend and capital distributions, and is registered

preferred, restricted voting, redeemable extendable, cumulative, registered share
type: Class
subclass of: CumulativePreferredShare
subclass of: ExtendablePreferredShare
subclass of: NonParticipatingPreferredShare
subclass of: PreferredShareWithFixedRateDividend
subclass of: RestrictedVotingShare
subclass of: RegisteredSecurity
subclass of: Class
  union of: RedeemablePreferredShareWithExtendableMaturityDate
  union of: RetractablePreferredShareWithExtendableMaturityDate
definition: preferred share that confers less than one vote per share, whose issuer and/or shareholders have the option to extend the maturity date, that provides a periodic stated income and dividends not paid in any year accumulate, and is registered

preferred, restricted voting, redeemable extendable, fixed income, registered share
type: Class
subclass of: ExtendablePreferredShare
subclass of: NonCumulativePreferredShare
subclass of: NonParticipatingPreferredShare
subclass of: PreferredShareWithFixedRateDividend
subclass of: RestrictedVotingShare
subclass of: RegisteredSecurity
subclass of: Class
  union of: RedeemablePreferredShareWithExtendableMaturityDate
  union of: RetractablePreferredShareWithExtendableMaturityDate
definition: preferred share that confers less than one vote per share, whose issuer and/or shareholders have the option to extend the maturity date, that provides a periodic stated income, and is registered

preferred, restricted voting, redeemable extendable, normal income, registered share
type: Class
subclass of: ExtendablePreferredShare
subclass of: RestrictedVotingShare
subclass of: RegisteredSecurity
subclass of: Class
  union of: RedeemablePreferredShareWithExtendableMaturityDate
  union of: RetractablePreferredShareWithExtendableMaturityDate
definition: preferred share that confers less than one vote per share, whose issuer and/or shareholders have the option to extend the maturity date, that provides the same dividends as common/ordinary shareholders, and is registered

preferred, restricted voting, redeemable extendable, participating, registered share
type: Class
subclass of: ExtendablePreferredShare
subclass of: NonCumulativePreferredShare
subclass of: ParticipatingPreferredShare
subclass of: PreferredShareWithFixedRateDividend
subclass of: RestrictedVotingShare
subclass of: RegisteredSecurity
subclass of: Class
  union of: RedeemablePreferredShareWithExtendableMaturityDate
  union of: RetractablePreferredShareWithExtendableMaturityDate
definition: preferred share that confers less than one vote per share, whose issuer and/or shareholders have the option to extend the maturity date, that provides a periodic stated income and participates with common shareholders in further dividend and capital distributions, and is registered

preferred, restricted voting, redeemable, fixed income, registered share
type: Class
subclass of: NonCumulativePreferredShare
subclass of: NonParticipatingPreferredShare
subclass of: PreferredShareWithFixedRateDividend
subclass of: RestrictedVotingShare
subclass of: RegisteredSecurity
subclass of: Class
  union of: RedeemablePreferredShare
  union of: RetractablePreferredShare
definition: preferred share that confers less than one vote per share, may be redeemed at the option of the issuer and/or of the shareholder, provides a periodic stated income, and is registered

preferred, restricted voting, redeemable, normal income, registered share
type: Class
subclass of: RestrictedVotingShare
subclass of: RegisteredSecurity
subclass of: Class
  union of: RedeemablePreferredShare
  union of: RetractablePreferredShare
definition: preferred share that confers less than one vote per share, may be redeemed at the option of the issuer and/or of the shareholder, provides the same dividends as common/ordinary shareholders, and is registered

preferred, restricted voting, redeemable, participating, registered share
type: Class
subclass of: NonCumulativePreferredShare
subclass of: ParticipatingPreferredShare
subclass of: PreferredShareWithFixedRateDividend
subclass of: RestrictedVotingShare
subclass of: RegisteredSecurity
subclass of: Class
  union of: RedeemablePreferredShare
  union of: RetractablePreferredShare
definition: preferred share that confers less than one vote per share, may be redeemed at the option of the issuer and/or of the shareholder, provides a periodic stated income and participates with common shareholders in further dividend and capital distributions, and is registered

preferred, voting, exchangeable, adjustable income, registered share
type: Class
subclass of: ExchangeablePreferredShare
subclass of: PreferredShareWithAdjustableRateDividend
subclass of: SingleVotingShare
subclass of: RegisteredSecurity
definition: preferred share that confers exactly one vote per share, may be exchanged for securities of another issuer, provides a periodic income whose dividend rate is set periodically, and is registered

preferred, voting, exchangeable, auction rate income, registered share
type: Class
subclass of: ExchangeablePreferredShare
subclass of: PreferredShareWithAuctionRateDividend
subclass of: SingleVotingShare
subclass of: RegisteredSecurity
definition: preferred share that confers exactly one vote per share, may be exchanged for securities of another issuer, provides a periodic income whose dividend rate is adjusted through an auction, and is registered

preferred, voting, exchangeable, cumulative participating, registered share
type: Class
subclass of: CumulativePreferredShare
subclass of: ExchangeablePreferredShare
subclass of: ParticipatingPreferredShare
subclass of: PreferredShareWithFixedRateDividend
subclass of: SingleVotingShare
subclass of: RegisteredSecurity
definition: preferred share that confers exactly one vote per share, may be exchanged for securities of another issuer, provides a periodic stated income, dividends not paid in any year accumulate, and participates with common shareholders in further dividend and capital distributions, and is registered

preferred, voting, exchangeable, cumulative, registered share
type: Class
subclass of: CumulativePreferredShare
subclass of: ExchangeablePreferredShare
subclass of: NonParticipatingPreferredShare
subclass of: PreferredShareWithFixedRateDividend
subclass of: SingleVotingShare
subclass of: RegisteredSecurity
definition: preferred share that confers exactly one vote per share, may be exchanged for securities of another issuer, provides a periodic stated income and dividends not paid in any year accumulate, and is registered

preferred, voting, exchangeable, fixed income, registered share
type: Class
subclass of: ExchangeablePreferredShare
subclass of: NonCumulativePreferredShare
subclass of: NonParticipatingPreferredShare
subclass of: PreferredShareWithFixedRateDividend
subclass of: SingleVotingShare
subclass of: RegisteredSecurity
definition: preferred share that confers exactly one vote per share, may be exchanged for securities of another issuer, provides a periodic stated income, and is registered

preferred, voting, exchangeable, normal income, registered share
type: Class
subclass of: ExchangeablePreferredShare
subclass of: NonCumulativePreferredShare
subclass of: SingleVotingShare
subclass of: RegisteredSecurity
definition: preferred share that confers exactly one vote per share, may be exchanged for securities of another issuer, provides the same dividends as common/ordinary shareholders, and is registered

preferred, voting, exchangeable, participating, registered share
type: Class
subclass of: ExchangeablePreferredShare
subclass of: NonCumulativePreferredShare
subclass of: ParticipatingPreferredShare
subclass of: PreferredShareWithFixedRateDividend
subclass of: SingleVotingShare
subclass of: RegisteredSecurity
definition: preferred share that confers exactly one vote per share, may be exchanged for securities of another issuer, provides a periodic stated income and participates with common shareholders in further dividend and capital distributions, and is registered

preferred, voting, extendable, adjustable income, registered share
type: Class
subclass of: ExtendablePreferredShare
subclass of: PreferredShareWithAdjustableRateDividend
subclass of: SingleVotingShare
subclass of: RegisteredSecurity
subclass of: Class
  union of: RedeemablePreferredShareWithExtendableRedemptionDate
  union of: RetractablePreferredShareWithExtendableRedemptionDate
definition: preferred share that confers exactly one vote per share, may be redeemed at the option of the issuer and/or of the shareholder with an extendable redemption date, provides a periodic income whose dividend rate is set periodically, and is registered

preferred, voting, extendable, auction rate income, registered share
type: Class
subclass of: ExtendablePreferredShare
subclass of: PreferredShareWithAuctionRateDividend
subclass of: SingleVotingShare
subclass of: RegisteredSecurity
subclass of: Class
  union of: RedeemablePreferredShareWithExtendableRedemptionDate
  union of: RetractablePreferredShareWithExtendableRedemptionDate
definition: preferred share that confers exactly one vote per share, may be redeemed at the option of the issuer and/or of the shareholder with an extendable redemption date, provides a periodic income whose dividend rate is adjusted through an auction, and is registered

preferred, voting, extendable, cumulative participating, registered share
type: Class
subclass of: CumulativePreferredShare
subclass of: ExtendablePreferredShare
subclass of: ParticipatingPreferredShare
subclass of: PreferredShareWithFixedRateDividend
subclass of: SingleVotingShare
subclass of: RegisteredSecurity
subclass of: Class
  union of: RedeemablePreferredShareWithExtendableRedemptionDate
  union of: RetractablePreferredShareWithExtendableRedemptionDate
definition: preferred share that confers exactly one vote per share, may be redeemed at the option of the issuer and/or of the shareholder with an extendable redemption date, provides a periodic stated income, dividends not paid in any year accumulate, and participates with common shareholders in further dividend and capital distributions, and is registered

preferred, voting, extendable, cumulative, registered share
type: Class
subclass of: CumulativePreferredShare
subclass of: ExtendablePreferredShare
subclass of: NonParticipatingPreferredShare
subclass of: PreferredShareWithFixedRateDividend
subclass of: SingleVotingShare
subclass of: RegisteredSecurity
subclass of: Class
  union of: RedeemablePreferredShareWithExtendableRedemptionDate
  union of: RetractablePreferredShareWithExtendableRedemptionDate
definition: preferred share that confers exactly one vote per share, may be redeemed at the option of the issuer and/or of the shareholder with an extendable redemption date, provides a periodic stated income and dividends not paid in any year accumulate, and is registered

preferred, voting, extendable, fixed income, registered share
type: Class
subclass of: ExtendablePreferredShare
subclass of: NonCumulativePreferredShare
subclass of: NonParticipatingPreferredShare
subclass of: PreferredShareWithFixedRateDividend
subclass of: SingleVotingShare
subclass of: RegisteredSecurity
subclass of: Class
  union of: RedeemablePreferredShareWithExtendableRedemptionDate
  union of: RetractablePreferredShareWithExtendableRedemptionDate
definition: preferred share that confers exactly one vote per share, may be redeemed at the option of the issuer and/or of the shareholder with an extendable redemption date, provides a periodic stated income, and is registered

preferred, voting, extendable, normal income, registered share
type: Class
subclass of: ExtendablePreferredShare
subclass of: NonCumulativePreferredShare
subclass of: SingleVotingShare
subclass of: RegisteredSecurity
subclass of: Class
  union of: RedeemablePreferredShareWithExtendableRedemptionDate
  union of: RetractablePreferredShareWithExtendableRedemptionDate
definition: preferred share that confers exactly one vote per share, may be redeemed at the option of the issuer and/or of the shareholder with an extendable redemption date, provides the same dividends as common/ordinary shareholders, and is registered

preferred, voting, extendable, participating, registered share
type: Class
subclass of: ExtendablePreferredShare
subclass of: NonCumulativePreferredShare
subclass of: ParticipatingPreferredShare
subclass of: PreferredShareWithFixedRateDividend
subclass of: SingleVotingShare
subclass of: RegisteredSecurity
subclass of: Class
  union of: RedeemablePreferredShareWithExtendableRedemptionDate
  union of: RetractablePreferredShareWithExtendableRedemptionDate
definition: preferred share that confers exactly one vote per share, may be redeemed at the option of the issuer and/or of the shareholder with an extendable redemption date, provides a periodic stated income and participates with common shareholders in further dividend and capital distributions, and is registered

preferred, voting, perpetual, adjustable income, registered share
type: Class
subclass of: PerpetualPreferredShare
subclass of: PreferredShareWithAdjustableRateDividend
subclass of: SingleVotingShare
subclass of: RegisteredSecurity
definition: preferred share that confers exactly one vote per share, has no fixed maturity date, provides a periodic income whose dividend rate is set periodically, and is registered

preferred, voting, perpetual, auction rate income, registered share
type: Class
subclass of: PerpetualPreferredShare
subclass of: PreferredShareWithAuctionRateDividend
subclass of: SingleVotingShare
subclass of: RegisteredSecurity
definition: preferred share that confers exactly one vote per share, has no fixed maturity date, provides a periodic income whose dividend rate is adjusted through an auction, and is registered

preferred, voting, perpetual, cumulative participating, registered share
type: Class
subclass of: CumulativePreferredShare
subclass of: ParticipatingPreferredShare
subclass of: PerpetualPreferredShare
subclass of: PreferredShareWithFixedRateDividend
subclass of: SingleVotingShare
subclass of: RegisteredSecurity
definition: preferred share that confers exactly one vote per share, has no fixed maturity date, provides a periodic stated income, dividends not paid in any year accumulate, and participates with common shareholders in further dividend and capital distributions, and is registered

preferred, voting, perpetual, cumulative, registered share
type: Class
subclass of: CumulativePreferredShare
subclass of: NonParticipatingPreferredShare
subclass of: PerpetualPreferredShare
subclass of: PreferredShareWithFixedRateDividend
subclass of: SingleVotingShare
subclass of: RegisteredSecurity
definition: preferred share that confers exactly one vote per share, has no fixed maturity date, provides a periodic stated income and dividends not paid in any year accumulate, and is registered

preferred, voting, perpetual, fixed income, registered share
type: Class
subclass of: NonCumulativePreferredShare
subclass of: NonParticipatingPreferredShare
subclass of: PerpetualPreferredShare
subclass of: PreferredShareWithFixedRateDividend
subclass of: SingleVotingShare
subclass of: RegisteredSecurity
definition: preferred share that confers exactly one vote per share, has no fixed maturity date, provides a periodic stated income, and is registered

preferred, voting, perpetual, normal income, registered share
type: Class
subclass of: NonCumulativePreferredShare
subclass of: PerpetualPreferredShare
subclass of: SingleVotingShare
subclass of: RegisteredSecurity
definition: preferred share that confers exactly one vote per share, has no fixed maturity date, provides the same dividends as common/ordinary shareholders, and is registered

preferred, voting, perpetual, participating, registered share
type: Class
subclass of: NonCumulativePreferredShare
subclass of: ParticipatingPreferredShare
subclass of: PerpetualPreferredShare
subclass of: PreferredShareWithFixedRateDividend
subclass of: SingleVotingShare
subclass of: RegisteredSecurity
definition: preferred share that confers exactly one vote per share, has no fixed maturity date, provides a periodic stated income and participates with common shareholders in further dividend and capital distributions, and is registered

preferred, voting, redeemable, adjustable income, registered share
type: Class
subclass of: PreferredShareWithAdjustableRateDividend
subclass of: SingleVotingShare
subclass of: RegisteredSecurity
subclass of: Class
  union of: RedeemablePreferredShare
  union of: RetractablePreferredShare
definition: preferred share that confers exactly one vote per share, may be redeemed at the option of the issuer and/or of the shareholder, provides a periodic income whose dividend rate is set periodically, and is registered

preferred, voting, redeemable, auction rate income, registered share
type: Class
subclass of: PreferredShareWithAuctionRateDividend
subclass of: SingleVotingShare
subclass of: RegisteredSecurity
subclass of: Class
  union of: RedeemablePreferredShare
  union of: RetractablePreferredShare
definition: preferred share that confers exactly one vote per share, may be redeemed at the option of the issuer and/or of the shareholder, provides a periodic income whose dividend rate is adjusted through an auction, and is registered

preferred, voting, redeemable, cumulative participating, registered share
type: Class
subclass of: CumulativePreferredShare
subclass of: ParticipatingPreferredShare
subclass of: PreferredShareWithFixedRateDividend
subclass of: SingleVotingShare
subclass of: RegisteredSecurity
subclass of: Class
  union of: RedeemablePreferredShare
  union of: RetractablePreferredShare
definition: preferred share that confers exactly one vote per share, may be redeemed at the option of the issuer and/or of the shareholder, provides a periodic stated income, dividends not paid in any year accumulate, and participates with common shareholders in further dividend and capital distributions, and is registered

preferred, voting, redeemable, cumulative, registered share
type: Class
subclass of: CumulativePreferredShare
subclass of: NonParticipatingPreferredShare
subclass of: PreferredShareWithFixedRateDividend
subclass of: SingleVotingShare
subclass of: RegisteredSecurity
subclass of: Class
  union of: RedeemablePreferredShare
  union of: RetractablePreferredShare
definition: preferred share that confers exactly one vote per share, may be redeemed at the option of the issuer and/or of the shareholder, provides a periodic stated income and dividends not paid in any year accumulate, and is registered

preferred, voting, redeemable exchangeable, adjustable income, registered share
type: Class
subclass of: ExchangeablePreferredShare
subclass of: PreferredShareWithAdjustableRateDividend
subclass of: SingleVotingShare
subclass of: RegisteredSecurity
subclass of: Class
  union of: RedeemablePreferredShare
  union of: RetractablePreferredShare
definition: preferred share that confers exactly one vote per share, may be redeemed at the option of the issuer and/or of the shareholder, provides a periodic income whose dividend rate is set periodically, and is registered

preferred, voting, redeemable exchangeable, auction rate income, registered share
type: Class
subclass of: ExchangeablePreferredShare
subclass of: PreferredShareWithAuctionRateDividend
subclass of: SingleVotingShare
subclass of: RegisteredSecurity
subclass of: Class
  union of: RedeemablePreferredShare
  union of: RetractablePreferredShare
definition: preferred share that confers exactly one vote per share, may be redeemed at the option of the issuer and/or of the shareholder, provides a periodic income whose dividend rate is adjusted through an auction, and is registered

preferred, voting, redeemable exchangeable, cumulative participating, registered share
type: Class
subclass of: CumulativePreferredShare
subclass of: ExchangeablePreferredShare
subclass of: ParticipatingPreferredShare
subclass of: PreferredShareWithFixedRateDividend
subclass of: SingleVotingShare
subclass of: RegisteredSecurity
subclass of: Class
  union of: RedeemablePreferredShare
  union of: RetractablePreferredShare
definition: preferred share that confers exactly one vote per share, may be exchanged for securities of another issuer, may be redeemed at the option of the issuer and/or of the shareholder, provides a periodic stated income, dividends not paid in any year accumulate, and participates with common shareholders in further dividend and capital distributions, and is registered

preferred, voting, redeemable exchangeable, cumulative, registered share
type: Class
subclass of: CumulativePreferredShare
subclass of: ExchangeablePreferredShare
subclass of: NonParticipatingPreferredShare
subclass of: PreferredShareWithFixedRateDividend
subclass of: SingleVotingShare
subclass of: RegisteredSecurity
subclass of: Class
  union of: RedeemablePreferredShare
  union of: RetractablePreferredShare
definition: preferred share that confers exactly one vote per share, may be exchanged for securities of another issuer, may be redeemed at the option of the issuer and/or of the shareholder, provides a periodic stated income and dividends not paid in any year accumulate, and is registered

preferred, voting, redeemable/exchangeable/extendable, adjustable income, registered share
type: Class
subclass of: ExchangeablePreferredShare
subclass of: ExtendablePreferredShare
subclass of: PreferredShareWithAdjustableRateDividend
subclass of: SingleVotingShare
subclass of: RegisteredSecurity
subclass of: Class
  union of: RedeemablePreferredShareWithExtendableMaturityDate
  union of: RetractablePreferredShareWithExtendableMaturityDate
definition: preferred share that confers exactly one vote per share, may be exchanged for securities of another issuer, whose issuer and/or shareholders have the option to extend the maturity date, that provides a periodic income whose dividend rate is set periodically, and is registered

preferred, voting, redeemable/exchangeable/extendable, auction rate income, registered share
type: Class
subclass of: ExchangeablePreferredShare
subclass of: ExtendablePreferredShare
subclass of: PreferredShareWithAuctionRateDividend
subclass of: SingleVotingShare
subclass of: RegisteredSecurity
subclass of: Class
  union of: RedeemablePreferredShareWithExtendableMaturityDate
  union of: RetractablePreferredShareWithExtendableMaturityDate
definition: preferred share that confers exactly one vote per share, may be exchanged for securities of another issuer, whose issuer and/or shareholders have the option to extend the maturity date, that provides a periodic income whose dividend rate is adjusted through an auction, and is registered

preferred, voting, redeemable/exchangeable/extendable, cumulative participating, registered share
type: Class
subclass of: CumulativePreferredShare
subclass of: ExchangeablePreferredShare
subclass of: ExtendablePreferredShare
subclass of: ParticipatingPreferredShare
subclass of: PreferredShareWithFixedRateDividend
subclass of: SingleVotingShare
subclass of: RegisteredSecurity
subclass of: Class
  union of: RedeemablePreferredShareWithExtendableMaturityDate
  union of: RetractablePreferredShareWithExtendableMaturityDate
definition: preferred share that confers exactly one vote per share, may be exchanged for securities of another issuer, whose issuer and/or shareholders have the option to extend the maturity date, that provides a periodic stated income, dividends not paid in any year accumulate, and participates with common shareholders in further dividend and capital distributions, and is registered

preferred, voting, redeemable/exchangeable/extendable, cumulative, registered share
type: Class
subclass of: CumulativePreferredShare
subclass of: ExchangeablePreferredShare
subclass of: ExtendablePreferredShare
subclass of: NonParticipatingPreferredShare
subclass of: PreferredShareWithFixedRateDividend
subclass of: SingleVotingShare
subclass of: RegisteredSecurity
subclass of: Class
  union of: RedeemablePreferredShareWithExtendableMaturityDate
  union of: RetractablePreferredShareWithExtendableMaturityDate
definition: preferred share that confers exactly one vote per share, may be exchanged for securities of another issuer, whose issuer and/or shareholders have the option to extend the maturity date, that provides a periodic stated income and dividends not paid in any year accumulate, and is registered

preferred, voting, redeemable/exchangeable/extendable, fixed income, registered share
type: Class
subclass of: ExchangeablePreferredShare
subclass of: ExtendablePreferredShare
subclass of: NonCumulativePreferredShare
subclass of: NonParticipatingPreferredShare
subclass of: PreferredShareWithFixedRateDividend
subclass of: SingleVotingShare
subclass of: RegisteredSecurity
subclass of: Class
  union of: RedeemablePreferredShareWithExtendableMaturityDate
  union of: RetractablePreferredShareWithExtendableMaturityDate
definition: preferred share that confers exactly one vote per share, may be exchanged for securities of another issuer, whose issuer and/or shareholders have the option to extend the maturity date, that provides a periodic stated income, and is registered

preferred, voting, redeemable/exchangeable/extendable, normal income, registered share
type: Class
subclass of: ExchangeablePreferredShare
subclass of: ExtendablePreferredShare
subclass of: NonCumulativePreferredShare
subclass of: SingleVotingShare
subclass of: RegisteredSecurity
subclass of: Class
  union of: RedeemablePreferredShareWithExtendableMaturityDate
  union of: RetractablePreferredShareWithExtendableMaturityDate
definition: preferred share that confers exactly one vote per share, may be exchanged for securities of another issuer, whose issuer and/or shareholders have the option to extend the maturity date, that provides the same dividends as common/ordinary shareholders, and is registered

preferred, voting, redeemable/exchangeable/extendable, participating, registered share
type: Class
subclass of: ExchangeablePreferredShare
subclass of: ExtendablePreferredShare
subclass of: NonCumulativePreferredShare
subclass of: ParticipatingPreferredShare
subclass of: PreferredShareWithFixedRateDividend
subclass of: SingleVotingShare
subclass of: RegisteredSecurity
subclass of: Class
  union of: RedeemablePreferredShareWithExtendableMaturityDate
  union of: RetractablePreferredShareWithExtendableMaturityDate
definition: preferred share that confers exactly one vote per share, may be exchanged for securities of another issuer, whose issuer and/or shareholders have the option to extend the maturity date, that provides a periodic stated income and participates with common shareholders in further dividend and capital distributions, and is registered

preferred, voting, redeemable exchangeable, fixed income, registered share
type: Class
subclass of: ExchangeablePreferredShare
subclass of: NonCumulativePreferredShare
subclass of: NonParticipatingPreferredShare
subclass of: PreferredShareWithFixedRateDividend
subclass of: SingleVotingShare
subclass of: RegisteredSecurity
subclass of: Class
  union of: RedeemablePreferredShare
  union of: RetractablePreferredShare
definition: preferred share that confers exactly one vote per share, may be exchanged for securities of another issuer, may be redeemed at the option of the issuer and/or of the shareholder, provides a periodic stated income, and is registered

preferred, voting, redeemable exchangeable, normal income, registered share
type: Class
subclass of: ExchangeablePreferredShare
subclass of: SingleVotingShare
subclass of: RegisteredSecurity
subclass of: Class
  union of: RedeemablePreferredShare
  union of: RetractablePreferredShare
definition: preferred share that confers exactly one vote per share, may be exchanged for securities of another issuer, may be redeemed at the option of the issuer and/or of the shareholder, provides the same dividends as common/ordinary shareholders, and is registered

preferred, voting, redeemable exchangeable, participating, registered share
type: Class
subclass of: ExchangeablePreferredShare
subclass of: NonCumulativePreferredShare
subclass of: ParticipatingPreferredShare
subclass of: PreferredShareWithFixedRateDividend
subclass of: SingleVotingShare
subclass of: RegisteredSecurity
subclass of: Class
  union of: RedeemablePreferredShare
  union of: RetractablePreferredShare
definition: preferred share that confers exactly one per share, may be exchanged for securities of another issuer, may be redeemed at the option of the issuer and/or of the shareholder, provides a periodic stated income and participates with common shareholders in further dividend and capital distributions, and is registered

preferred, voting, redeemable extendable, adjustable income, registered share
type: Class
subclass of: ExtendablePreferredShare
subclass of: PreferredShareWithAdjustableRateDividend
subclass of: SingleVotingShare
subclass of: RegisteredSecurity
subclass of: Class
  union of: RedeemablePreferredShareWithExtendableMaturityDate
  union of: RetractablePreferredShareWithExtendableMaturityDate
definition: preferred share that confers exactly one vote per share, whose issuer and/or shareholders have the option to extend the maturity date, that provides a periodic income whose dividend rate is set periodically, and is registered

preferred, voting, redeemable extendable, auction rate income, registered share
type: Class
subclass of: ExtendablePreferredShare
subclass of: PreferredShareWithAuctionRateDividend
subclass of: SingleVotingShare
subclass of: RegisteredSecurity
subclass of: Class
  union of: RedeemablePreferredShareWithExtendableMaturityDate
  union of: RetractablePreferredShareWithExtendableMaturityDate
definition: preferred share that confers exactly one vote per share, whose issuer and/or shareholders have the option to extend the maturity date, that provides a periodic income whose dividend rate is adjusted through an auction, and is registered

preferred, voting, redeemable extendable, cumulative participating, registered share
type: Class
subclass of: CumulativePreferredShare
subclass of: ExtendablePreferredShare
subclass of: ParticipatingPreferredShare
subclass of: PreferredShareWithFixedRateDividend
subclass of: SingleVotingShare
subclass of: RegisteredSecurity
subclass of: Class
  union of: RedeemablePreferredShareWithExtendableMaturityDate
  union of: RetractablePreferredShareWithExtendableMaturityDate
definition: preferred share that confers exactly one vote per share, whose issuer and/or shareholders have the option to extend the maturity date, that provides a periodic stated income, dividends not paid in any year accumulate, and participates with common shareholders in further dividend and capital distributions, and is registered

preferred, voting, redeemable extendable, cumulative, registered share
type: Class
subclass of: CumulativePreferredShare
subclass of: ExtendablePreferredShare
subclass of: NonParticipatingPreferredShare
subclass of: PreferredShareWithFixedRateDividend
subclass of: SingleVotingShare
subclass of: RegisteredSecurity
subclass of: Class
  union of: RedeemablePreferredShareWithExtendableMaturityDate
  union of: RetractablePreferredShareWithExtendableMaturityDate
definition: preferred share that confers exactly one vote per share, whose issuer and/or shareholders have the option to extend the maturity date, that provides a periodic stated income and dividends not paid in any year accumulate, and is registered

preferred, voting, redeemable extendable, fixed income, registered share
type: Class
subclass of: ExtendablePreferredShare
subclass of: NonCumulativePreferredShare
subclass of: NonParticipatingPreferredShare
subclass of: PreferredShareWithFixedRateDividend
subclass of: SingleVotingShare
subclass of: RegisteredSecurity
subclass of: Class
  union of: RedeemablePreferredShareWithExtendableMaturityDate
  union of: RetractablePreferredShareWithExtendableMaturityDate
definition: preferred share that confers exactly one vote per share, whose issuer and/or shareholders have the option to extend the maturity date, that provides a periodic stated income, and is registered

preferred, voting, redeemable extendable, normal income, registered share
type: Class
subclass of: ExtendablePreferredShare
subclass of: SingleVotingShare
subclass of: RegisteredSecurity
subclass of: Class
  union of: RedeemablePreferredShareWithExtendableMaturityDate
  union of: RetractablePreferredShareWithExtendableMaturityDate
definition: preferred share that confers exactly one vote per share, whose issuer and/or shareholders have the option to extend the maturity date, that provides the same dividends as common/ordinary shareholders, and is registered

preferred, voting, redeemable extendable, participating, registered share
type: Class
subclass of: ExtendablePreferredShare
subclass of: NonCumulativePreferredShare
subclass of: ParticipatingPreferredShare
subclass of: PreferredShareWithFixedRateDividend
subclass of: SingleVotingShare
subclass of: RegisteredSecurity
subclass of: Class
  union of: RedeemablePreferredShareWithExtendableMaturityDate
  union of: RetractablePreferredShareWithExtendableMaturityDate
definition: preferred share that confers exactly one vote per share, whose issuer and/or shareholders have the option to extend the maturity date, that provides a periodic stated income and participates with common shareholders in further dividend and capital distributions, and is registered

preferred, voting, redeemable, fixed income, registered share
type: Class
subclass of: NonCumulativePreferredShare
subclass of: NonParticipatingPreferredShare
subclass of: PreferredShareWithFixedRateDividend
subclass of: SingleVotingShare
subclass of: RegisteredSecurity
subclass of: Class
  union of: RedeemablePreferredShare
  union of: RetractablePreferredShare
definition: preferred share that confers exactly one vote per share, may be redeemed at the option of the issuer and/or of the shareholder, provides a periodic stated income, and is registered

preferred, voting, redeemable, normal income, registered share
type: Class
subclass of: SingleVotingShare
subclass of: RegisteredSecurity
subclass of: Class
  union of: RedeemablePreferredShare
  union of: RetractablePreferredShare
definition: preferred share that confers exactly one vote per share, may be redeemed at the option of the issuer and/or of the shareholder, provides the same dividends as common/ordinary shareholders, and is registered

preferred, voting, redeemable, participating, registered share
type: Class
subclass of: NonCumulativePreferredShare
subclass of: ParticipatingPreferredShare
subclass of: PreferredShareWithFixedRateDividend
subclass of: SingleVotingShare
subclass of: RegisteredSecurity
subclass of: Class
  union of: RedeemablePreferredShare
  union of: RetractablePreferredShare
definition: preferred share that confers exactly one vote per share, may be redeemed at the option of the issuer and/or of the shareholder, provides a periodic stated income and participates with common shareholders in further dividend and capital distributions, and is registered